{"text_format":"3","workbook":"xlsx","n_sheets":13,"sheets":["Data extraction-synthesis","Input TPP scoping phase source","Input source drafting TPP","Input source analytic accuracy","Input source diagn accuracy","Decision-making steps","Stakeholders involved","Transparency checklist","Draft TPP ","Additional data part 1","Additional data part 2","Percentages","Settings"],"not_rendered":{"charts":1,"macros":1},"read":"whole","date_system":"1900"}

{"sheet":"Data extraction-synthesis","index":0,"n_rows":45,"n_cols":16,"rows_kept":45}
["Date of data extraction","Author(s)","Article title","Year","Type of publication","Disease area","Broader disease area","Test(s) being assessed","Type(s) of sources to populate a TPP","Type(s) of sources to inform accuracy-related test characteristics","Type of input sources considered during scoping phase","Which decision-making steps underlying the development of TPP(s) of interest ","Types of stakeholders involved ","Funding body","Does the study reports the source of funding?","Source"]
["2019-02-08","Chua, A. P., I.: Nuebling, C. M.: Wood, D.: Moussy, F.","Update on Zika Diagnostic Tests and WHO's Related Activities",2017,"Journal article","Zika virus","Vector-borne disease/infection","Diagnostic test for zika infection and blood bank testing ","Literature, Meeting input","No input sources reported","No scoping phase reported","Meeting with experts/stakeholders , Draft TPP, Consensus/public meeting, Feedback from the consultation (e.g. survey, meeting, expert opinion) is incorporated into the final TPPs","Academia/researchers, International/public health institution , Scientific associations","NO","NO","Database search"]
["2019-02-08","Denkinger, C. M. D., D.: Schito, M.: Wells, W.: Cobelens, F.: Pai, M.: Zignol, M.: Cirillo, D. M.: Alland, D.: Casenghi, M.: Gallarda, J.: Boehme, C. C.: Perkins, M. D","Target Product Profile of a Molecular Drug-Susceptibility Test for Use in Microscopy Centers",2015,"Journal article","Tubercolosis","Respiratory infection","A molecular drug-susceptibility test","Literature, Surveys with experts/expert opinion, Models ","Literature, Models ","Literature , Market analyses, Data available, Survey with experts/Expert opinion","Mapping  , Survey to measure stakeholder’s preferences and agreement , Landscaping exercise , Draft TPP, Round of revisions of TPP, Draft shortened TPP, Presentation of shortened TPP to large stakeholder audience, Consensus/public meeting","Academia/researchers, Clinicians, Policy makers, Test developers, Laboratory experts, Implementers, Representatives of countries and national disease programs","Bill and Melinda Gates Foundation; American Society of Tropical Medicine and Hygiene; National Institute of Allergy and Infectious Diseases, National Institutes of Health, Department of Health and Human Services","yes","Both"]
["2019-02-08","Denkinger, C. M. K., Sandra V.: Cirillo, Daniela Maria: Casenghi, Martina: Shinnick, Thomas: Weyer, Karin: Gilpin, Chris: Boehme, Catharina C.: Schito, Marco: Kimerling, Michael: Pai, Madhuka","Defining the needs for next generation assays for tuberculosis",2015,"Journal article","Tubercolosis","Respiratory infection","1) A diagnostic test 2) A diagnostic biomarker test 3) A referall screening test","Literature, Interviews with experts, Models ","Literature, Models ","Literature, Survey with experts/Expert opinion, Reports","Definition problem statement/use case  , Prioritization exercise , Draft TPP, Round of revisions of TPP, Draft shortened TPP, Presentation of shortened TPP to large stakeholder audience, Delphi-like approach to gauge stakeholders’ agreement with the TPP, Consensus/public meeting","Representatives of countries and national disease programs, Clinicians, Academia/researchers, Laboratory experts, Patient/community advocates, Modelers, Market experts, Policy makers, Test developers, Technical/funding agencies ","Bill and Melinda Gates Foundation","YES","Database search"]
["2019-02-08","DIAMETER Project, PATH","Point-of-Care Malaria Infection Detection Test For rapid detection of low-density, subclinical malaria infections",2014,"Report","Malaria ","Vector-borne disease/infection","A POC infection detection test","Literature, Available data, Field observations, Models ","Literature, Surveys with experts/expert opinion","No scoping phase reported","N/A ","N/A","Bill and Melinda Gates Foundation","YES","Website search "]
["2019-02-08","Ding, X. C. A., Maria Paz: Baird, J. Kevin: Cheng, Qin: Cunningham, Jane: Dhorda, Mehul: Drakeley, Chris: Felger, Ingrid: Gamboa, Dionicia: Harbers, Matthias: Herrera, Socrates: Lucchi, Naomi: Mayor, Alfredo: Mueller, Ivo: Sattabongkot, Jetsumon: Ratsimbason, Arsène: Richards, Jack: Tanner, Marcel: González, Iveth J.","Defining the next generation of Plasmodium vivax diagnostic tests for control and elimination: Target product profiles",2017,"Journal article","Malaria ","Vector-borne disease/infection","1) A diagnostic test 2) A POC diagnostic test 3) A screening test","Literature, Surveys with experts/expert opinion, Models ","Literature, Models ","Survey with experts/Expert opinion","Definition problem statement/use case  , Draft TPP, Round of revisions of TPP, Survey to measure stakeholder’s preferences and agreement ","Academia/researchers, Representatives of countries and national disease programs, International/public health institution ","Department of Foreign Affairs and Trade,","YES","Both"]
["2019-02-08","Dittrich, S. T., B. T.: Moussy, F.: Chua, A.: Zorzet, A.: Tangden, T.: Dolinger, D. L.: Page, A. L.: Crump, J. A.: Valerie, D.: Bassat, Q.: Lubell, Y.: Heinrich, N.: Newton, P. N.: Rodwell, T.: Gonzalez, I. J.","Target Product Profile for a Diagnostic Assay to Differentiate between Bacterial and Non-Bacterial Infections to Guide Antimicrobials Use in Resource-Limited Settings: An Expert Consensus",2016,"Journal article","Malaria","Vector-borne disease/infection","A test to distinguish bacterial from non-bacterial infections","Literature, Surveys with experts/expert opinion, Industry standard","Surveys with experts/expert opinion","Literature ","Landscaping exercise , Draft TPP, Delphi-like approach to gauge stakeholders’ agreement with the TPP, Round of revisions of TPP, Feedback from the consultation (e.g. survey, meeting, expert opinion) is incorporated into the final TPPs, Prioritization exercise , Consensus/public meeting","Academia/researchers, Laboratory experts, Microbiologists, Health economists, Test developers, International/public health institution ","the Dutch Government, with aid from the UK and the Australian Government","YES","Both"]
["2019-02-08","WHO","High-priority target product profile for hepatitis C diagnosis in decentralized settings: Report of a consensus meeting. ",2015,"Report","Hepatits C","Vector-borne disease/infection","1) HCV nucleic acid amplification diagnostic test 2) HCV cAg diagnostictest","Literature, Surveys with experts/expert opinion, Models ","Literature, Surveys with experts/expert opinion, Models , Available data","Survey with experts/Expert opinion","Prioritization exercise , Draft TPP, Draft shortened TPP, Delphi-like approach to gauge stakeholders’ agreement with the TPP, Consensus/public meeting","Clinicians, Implementers, Representatives of countries and national disease programs, Test developers, Technical/funding agencies , Patient/community advocates, International/public health institution , Academia/researchers, Other",null,"NO","Website search "]
["2019-02-08","Gal, M. F., N. A.: Hood, K.: Villacian, J.: Goossens, H.: Watkins, A.: Butler, C. C.","Matching diagnostics development to clinical need: Target product profile development for a point of care test for community-acquired lower respiratory tract infection",2018,"Journal article","Community-acquired lower respiratory tract infection","Respiratory infection","POC test","Literature, Surveys with experts/expert opinion, Meeting input, Interviews with experts","Literature","Survey with experts/Expert opinion","Prioritization exercise , Survey to retrieve input relevant for TPP , Draft TPP, Meeting with experts/stakeholders , Feedback from the consultation (e.g. survey, meeting, expert opinion) is incorporated into the final TPPs","Clinicians, Microbiologists, Test developers, Industry (unspecific), Academia/researchers, Market experts","Innovative Medicines Initiative IMI-JU-02-2009-04 Infectious Diseases-Diagnostic Tools","YES","Database search"]
["2019-02-08","Lim, M. D. B., S. J.: Belizario, V. Y., Jr.: Gay-Andrieu, F.: Gilleard, J.: Levecke, B.: Lieshout, L. van: Medley, G. F.: Mekonnen, Z.: Mirams, G.: Njenga, S. M.: Odiere, M. R.: Rudge, J. W.: Stuyver, L.: Vercruysse, J.: Vlaminck, J.: Walson, J. L. ","Diagnostic tools for soil-transmitted helminths control and elimination programs: a pathway for diagnostic product development",2018,"Journal article","Soil-transmitted helminths","Neglected tropical diseases","1) a diagnostic test for mapping-monitoring 2) diagnostic test to confirm decision to stop intervention","Surveys with experts/expert opinion, Guidelines, Literature, Meeting input","Literature","Survey with experts/Expert opinion, Literature ","Landscaping exercise , Definition problem statement/use case  , Draft TPP, Round of revisions of TPP, Meeting with experts/stakeholders , Feedback from the consultation (e.g. survey, meeting, expert opinion) is incorporated into the final TPPs","Academia/researchers, Implementers, Test developers","no","no","Database search"]
["2019-02-08","Nsanzabana, C. A., Frederic: Beck, Hans-Peter: Ding, Xavier C.: Kamau, Edwin: Krishna, Sanjeev: Legrand, Eric: Lucchi, Naomi: Miotto, Olivo: Nag, Sidsel: Noedl, Harald: Roper, Cally: Rosenthal, Philip J.: Schallig, Henk D. F. H.: Taylor, Steve M.: Volkman, Sarah K.: Gonzalez, Iveth J.","Molecular assays for antimalarial drug resistance surveillance: A target product profile",2018,"Journal article","Antimalaria drug resistance","Vector-borne disease/infection","Antimalarial drug resistance diagnostic test","Literature","Literature","Literature ","Landscaping exercise , Draft TPP, Survey to measure stakeholder’s preferences and agreement , Consensus/public meeting, Feedback from the consultation (e.g. survey, meeting, expert opinion) is incorporated into the final TPPs","Academia/researchers, International/public health institution , Industry (unspecific)",null,"NO","Both"]
["2019-02-08","Porras, A. I. Y., Z. E.: Altcheh, J.: Britto, C.: Chaves, G. C.: Flevaud, L.: Martins, O. A.: Ribeiro, I.: Schijman, A. G.: Shikanai-Yasuda, M. A.: Sosa-Estani, S.: Stobbaerts, E.: Zicker, F.","Target Product Profile (TPP) for Chagas Disease Point-of-Care Diagnosis and Assessment of Response to Treatmen",2015,"Journal article","Chagas disease/America trypanosomiasis ","Neglected tropical diseases","1-2) a POC diagnostic test 3) a treatment-monitoring test","Meeting input","No input sources reported","Survey with experts/Expert opinion","Meeting with experts/stakeholders , Definition problem statement/use case  , Draft TPP","N/A","Pan-Amertican Health Organization and The Special Programme for Research and Training in Tropical Diseases","YES","Both"]
["2019-02-08","Reipold, E. I. E., Philippa: Trianni, Alessandra: Panneer, Nivedha: Krakower, Douglas: Ongarello, Stefano: Roberts, Teri: Miller, Veronica: Denkinger, Claudia","Optimising diagnosis of viraemic hepatitis C infection: the development of a target product profile",2017,"Journal article","Hepatitis C ","Vector-borne disease/infection","A diagnostic test","Literature, Surveys with experts/expert opinion, Models ","Literature, Surveys with experts/expert opinion, Models ","Survey with experts/Expert opinion","Identification of stakeholders to involve in draft TPP , Prioritization exercise , Definition TPP domains , Draft TPP, Delphi-like approach to gauge stakeholders’ agreement with the TPP, Consensus/public meeting","International/public health institution , Academia/researchers, Technical/funding agencies , Industry (unspecific), Patient/community advocates, Representatives of countries and national disease programs, Clinicians, Implementers, Policy makers,  Program manager","WHO","YES","Both"]
["2019-02-11","Solomon, A. W. E., D.: Bailey, R. L.: Blake, I. M.: Brooker, S.: Chen, J. X.: Chen, J. H.: Churcher, T. S.: Drakeley, C. J.: Edwards, T.: Fenwick, A.: French, M.: Gabrielli, A. F.: Grassly, N. C.: Harding-Esch, E. M.: Holland, M. J.: Koukounari, A.: Lammie, P. J.: Leslie, J.: Mabey, D. C.: Rhajaoui, M.: Secor, W. E.: Stothard, J. R.: Wei, H.: Willingham, A. L.: Zhou, X. N.: Peeling, R. W.","A diagnostics platform for the integrated mapping, monitoring, and surveillance of neglected tropical diseases: Rationale and target product profiles",2012,"Journal article","Neglected tropical diseases ( lymphatic filariasis, trachoma, schistosomiasis, onchocerciasis, soil-transmitted helminths)","Neglected tropical diseases","1) A diagnostic tool with mapping and impact monitoring potential 2) A diagnostic tool","Consensus meeting inputs","No input sources reported","No scoping phase reported","Draft TPP","Laboratory experts, Modelers, Health economists, Experts (unspecific),  Program manager","WHO","YES","Database search"]
["2019-02-11","Toskin, I. M., M.: Peeling, R. W.: Blondeel, K.: Cordero, J.: Kiarie, J.","Advancing prevention of sexually transmitted infections through point-of-care testing: target product profiles and landscape analysis",2017,"Journal article","Sexually transmitted infections","Sexually transmitted infections/diseases","A combined diagnostic POC 2) POC platforms 3) A combined diagnostic test","Literature, Models , Surveys with experts/expert opinion, Consensus meeting inputs, Interviews with experts","Consensus meeting inputs","Literature , Reports, Websites of developers, Interviews with experts, Policies","Landscaping exercise , Reviewing available literature and data, Survey to retrieve input relevant for TPP , Draft TPP, Consensus/public meeting, Feedback from the consultation (e.g. survey, meeting, expert opinion) is incorporated into the final TPPs, Round of revisions of TPP","Clinicians, Test developers, International/public health institution , Experts (unspecific), Laboratory experts, Microbiologists",null,"NO","Database search"]
["2019-02-11","Donadeu, M. F., A. S.: Olliaro, P. L.: Abela-Ridder, B","Target product profiles for the diagnosis of Taenia solium taeniasis, neurocysticercosis and porcine cysticercosis",2017,"Journal article","Taenia solium taeniasis, neurocysticercosis and porcine cysticercosis","Neglected tropical diseases","1) A POC test that could be used for surveillance 2) A specific test 3)A POC test 4) A monitoring test","Surveys with experts/expert opinion, Literature","Literature, Surveys with experts/expert opinion","Survey with experts/Expert opinion","Meeting with experts/stakeholders , Identification of most important needs, Draft TPP, Survey to measure stakeholder’s preferences and agreement , Feedback from the consultation (e.g. survey, meeting, expert opinion) is incorporated into the final TPPs, Round of revisions of TPP","International/public health institution , Representatives of countries and national disease programs, Experts (unspecific), Industry (unspecific), Academia/researchers, Clinicians","NO","NO","Both"]
["2019-02-11","FIND","Target Product Profile for Tests for Recent HIV Infection",2017,"Report","HIV Infection","Sexually transmitted infections/diseases","A diagnostic test","Surveys with experts/expert opinion, Meeting input","No input sources reported","Survey with experts/Expert opinion","Definition problem statement/use case  , Identification of most important needs, Draft TPP, Consolidation of findings, Draft shortened TPP, Delphi-like approach to gauge stakeholders’ agreement with the TPP, Feedback from the consultation (e.g. survey, meeting, expert opinion) is incorporated into the final TPPs, Consensus/public meeting","Academia/researchers, International/public health institution , Scientific associations, Industry (unspecific), Policy makers, Non-profit sector","Bill & Melinda Gates Foundation","YES","Website search "]
["2019-02-11","FIND","Target Product Profile: Rapid test for diagnosis of malaria and screening for hyman African trypanosomiasis (HAT)",2017,"Report","Human African trypanosomiasis ","Vector-borne disease/infection","Rapid test for diagnosis and screening","No input sources reported","No input sources reported","No scoping phase reported","Draft TPP, Delphi-like approach to gauge stakeholders’ agreement with the TPP","Academia/researchers, Non-profit sector, Industry (unspecific)",null,"NO","Website search "]
["2019-02-11","PATH","Target Product Profile: HIV Self-Test Version 4.1: A White Paper on the Evaluation of Current HIV Rapid Tests and Development of Core Specifications for Next-Generation HIV Tests",2014,"Report","HIV ","Sexually transmitted infections/diseases","A self-test","Literature, Interviews with experts, Available data, Early usability studies , Laboratory evaluations","Literature, Laboratory evaluations, Early usability studies ","No scoping phase reported","Draft TPP, Round of revisions of TPP","N/A","Bill & Melinda Gates Foundation","yes","Website search "]
[{"$f":"A19","v":"2019-02-11"},"PATH","Diagnostics for neglected tropical diseases: Defining the best tools through target product profiles",2015,"Report","Neglected Tropical Diseases","Neglected tropical diseases",{"$f":"F20","v":"Neglected Tropical Diseases"},"Interviews with experts","N/A","Literature , Interviews with experts","Reviewing available literature and data, Definition problem statement/use case  , Draft TPP, Feedback from the consultation (e.g. survey, meeting, expert opinion) is incorporated into the final TPPs, Round of revisions of TPP","Industry (unspecific), Academia/researchers, Representatives of countries and national disease programs, Non-profit sector, Policy makers, Donors","Bill & Melinda Gates Foundation, United Kingdom Department for International Development","yes","Website search "]
["2019-02-11","PATH","Target Product Profile: Schistosomiasis Surveillance Diagnostic",2015,"Report","Schistosomiasis","Neglected tropical diseases","A rapid diagnostic test","Guidelines, Literature, Interviews with experts, Field observations, Available data","Literature","No scoping phase reported","N/A ","N/A",null,"NO","Website search "]
[{"$f":"A21","v":"2019-02-11"},"UNICEF","UNICEF Target Product Profile Rapid E.coli Detection (version 2.0)",2017,"Report","E.coli infection/diarrhoea","Vector-borne disease/infection","Water quality testing product","No input sources reported","No input sources reported","N/A","N/A ","N/A","No","No","Website search "]
["2019-02-11","UNICEF","UNICEF Target Product Profile Rapid E.coli Detection (1.4)",2016,"Report","E.coli infection/diarrhoea","Vector-borne disease/infection","Water quality testing product","No input sources reported","No input sources reported","N/A","N/A ","N/A ",null,"NO","Website search "]
["2019-02-11","WHO","High-priority target product profile for new tubercolosis diagnostics: report of a consensus meeting",2014,"Report","Tubercolosis","Respiratory infection","1) A diagnostic test 2) A diagnostic biomarker test 3) A referall screening test 4) A drug-susceptibility test","Literature, Surveys with experts/expert opinion, Consensus meeting inputs, Models ","Literature, Models , Surveys with experts/expert opinion","Survey with experts/Expert opinion","Prioritization exercise , Draft TPP, Draft shortened TPP, Delphi-like approach to gauge stakeholders’ agreement with the TPP, Consensus/public meeting","Academia/researchers, Industry (unspecific), Representatives of countries and national disease programs, Technical/funding agencies , Implementers, Clinicians, Donors, International/public health institution ","Bill and Melinda Gates Foundation","yes ","Website search "]
["2019-02-11","WHO","Development of a Target Product Profile (TPP) and framework for evaluation for a test predicting progression from tubercolosis infection to active disease",2017,"Report","Tubercolosis","Respiratory infection","A test for predicting disease progression","Surveys with experts/expert opinion, Meeting input","N/A","No scoping phase reported","Meeting with experts/stakeholders , Draft TPP, Survey to retrieve input relevant for TPP , Delphi-like approach to gauge stakeholders’ agreement with the TPP, Consensus/public meeting","Academia/researchers, International/public health institution , Non-profit sector, Patient/community advocates, Test developers, Scientific associations, Representatives of countries and national disease programs, Technical/funding agencies , Donors","NO","no","Website search "]
["2019-02-11","WHO","Specifications for a rapid diagnostic test for meningitis African meningitis belt/ Target product profile for the development of a new generation of rapid test for the diagnosis of bacterial meningitis",2016,"Report","Meningits","Meningitis","A rapid diagnostic test","No input sources reported","No input sources reported","No scoping phase reported","N/A ","N/A","NO","no","Website search "]
["2019-02-11","WHO","Target Product Profile for Zaire ebolavirus rapid,simple test to be used in the control of the Ebola outbreak in West Africa",2014,"Report","Ebola virus","Ebola virus","A rapid test","No input sources reported","No input sources reported","No scoping phase reported","N/A ","International/public health institution , Non-profit sector","no","no","Website search "]
["2019-02-11","WHO","Report of WHO-FIND meeting on diagnostics for Buruli ulcer",2018,"Report","Buruli ulcer","Neglected tropical diseases","1) A rapid diagnostic test 2)A diagnostic test with treatment-monitoring potential","Meeting input","N/A","Survey with experts/Expert opinion","Definition problem statement/use case  , Draft TPP","Academia/researchers, International/public health institution , Policy makers, Clinicians","NO","NO","Website search "]
["2019-02-11","WHO","Taenia solium taeniasis/cysticercosis diagnostic tools. Report of a stakeholder meeting",2016,"Report","Taenia solium taeniasis/cysticercosis","Neglected tropical diseases",null,"Meeting inputs","N/A","Survey with experts/Expert opinion","Definition problem statement/use case  , Draft TPP","Academia/researchers, International/public health institution ","no","no","Website search "]
["2019-02-11","Utzinger, J. B., S. L.: van Lieshout, L.: van Dam, G. J.: Knopp, S","New diagnostic tools in schistosomiasis",2015,"Journal article","Schistosomiasis","Neglected tropical diseases","1) A diagnostic test for mapping-monitoring 2) A diagnostic tool","No input sources reported","N/A","No scoping phase reported","N/A ","N/A","Bill & Melinda Gates Foundation","yes","Website search "]
["2019-02-11","UNICEF","Zika Virus Diagnostics: Target Product Profiles & Supply Update",2017,"Report","Zika virus","Vector-borne disease/infection","A diagnostic test ","Literature, Interviews with experts, Surveys with experts/expert opinion","N/A","Survey with experts/Expert opinion","Defining scope TPP , Draft TPP, Round of revisions of TPP, Feedback from the consultation (e.g. survey, meeting, expert opinion) is incorporated into the final TPPs","Academia/researchers, International/public health institution , Industry (unspecific)",null,"NO","Website search "]
["2019-02-11","UNICEF","Pneumonia Acute Respiratory Infection Diagnostic Aid-Target Product Profile Introduction",2014,"Report","Pneumonia Acute Respiratory infection","Respiratory infection","A diagnostic aid","Interviews with experts, Literature","N/A","Literature, Survey with experts/Expert opinion ","Reviewing available literature and data, Defining scope TPP , Draft TPP, Round of revisions of TPP, Survey to measure stakeholder’s preferences and agreement ","Industry (unspecific), Academia/researchers, International/public health institution ",null,"NO","Website search "]
["2019-02-11","Pal S, Jasper L.E., Lawrence K.L, Walter M","Assessing the Dengue Diagnosis Capability Gap in the Military Health System",2016,"Journal article","Dengue fever","Vector-borne disease/infection","A diagnostic test","Surveys with experts/expert opinion, Models ","Surveys with experts/expert opinion, Models ","Questionnaire provided to expert","Identification of most important needs, Draft TPP","Experts (unspecific), Other","Military Infectious Diseases Research Program, U.S. Army Medical Research and\nMateriel Command, Fort Detrick, Maryland.\n","yes","Database search"]
["2019-02-11","PATH","Target Product Profile: Schistosomiasis Surveillance Diagnostic Lateral Flow Test CAA antigen",2015,"Report","Schistosomiasis","Neglected tropical diseases","A lateral flow test","Literature, Surveys with experts/expert opinion, Interviews with experts, Field observations, Guidelines, Available data","Literature","No scoping phase reported","N/A ","N/A","no","no","Website search "]
["2019-02-11","PATH","Target Product Profile: Trachoma Surveillance Diagnostic-Post-Elimination Surveillance Antibody Lateral Flow Test",2015,"Report","Trachoma","Neglected tropical diseases","A lateral flow rapid diagnostic test","Literature, Guidelines, Available data, Surveys with experts/expert opinion, Interviews with experts","Literature","No scoping phase reported","N/A ","N/A","nO","NO","Website search "]
["2019-02-11","International Diagnostics Centre (IDC)","Target Product Profile (TPP) - Point-of-Care HIV Viral Load Test",2013,"Published TPP","HIV ","Sexually transmitted infections/diseases","A POC test","No input sources reported","No input sources reported","No scoping phase reported","N/A ","N/A","NO","NO","Website search "]
["2019-02-11","International Diagnostics Centre (IDC)","Target Product Profile (TPP)- Point of care CD4 test",2013,"Published TPP","HIV ","Sexually transmitted infections/diseases","A POC test","No input sources reported","No input sources reported","No scoping phase reported","N/A ","N/A","no","no","Website search "]
["2019-02-11","International Diagnostics Centre (IDC)","Target Product Profile (TPP): Point of care EID test",2013,"Published TPP","HIV ","Sexually transmitted infections/diseases","A POC","No input sources reported","No input sources reported","No scoping phase reported","N/A ","N/A","no","no","Website search "]
["2019-02-11","Internationa Diagnostics Centre (IDC)","Target Product Profile (TPP): Combined HIV/Syphilis Test",2014,"Published TPP","HIV and Syphilis","Sexually transmitted infections/diseases","A combined test","No input sources reported","No input sources reported","No scoping phase reported","N/A ","N/A","no","no","Website search "]
["2019-02-11","Ebels, K. B. C., C.: Crudder, C. H.: McGray, S.: Magnuson, K.: Tietje, K.: Labarre, P","Incorporating user needs into product development for improved infection detection for malaria elimination programs",2014,"Journal article","Malaria","Vector-borne disease/infection","A diagnostic test","Interviews with experts, Field observations","N/A","Field research, Ethnographic interviews","Definition problem statement/use case  , Consolidation of findings, Draft TPP","Test developers, Academia/researchers, Strategists,  Program manager, International/public health institution , Representatives of countries and national disease programs, Policy makers, Donors, Clinicians, Laboratory experts, Microbiologists","NO","NO","Database search"]
["2019-02-11","FIND","Target Product Profile: Screening test for human African trypanosomiasis (HAT)",2017,"Report","Human African trypanosomiasis ","Neglected tropical diseases","A screening test","No input sources reported","No input sources reported","No scoping phase reported","Draft TPP, Delphi-like approach to gauge stakeholders’ agreement with the TPP","Academia/researchers, International/public health institution , Non-profit sector, Industry (unspecific)",null,"NO","Website search "]
["2019-02-11","PATH","Target Product Profile: Trachoma surveillance diagnostic-antigen lateral flow test",2015,"Report","Trachoma","Neglected tropical diseases","A lateral flow test","Literature, Guidelines, Surveys with experts/expert opinion, Available data","Literature","No scoping phase reported","N/A ","N/A","no","no","Website search "]
["2019-02-11","Peck, R. B. W., J. D.: Boettcher, M. G.: Downing","Defining product requirements for field deployable yellow fever tests",2015,"Poster","Yellow fever","Vector-borne disease/infection","A field-deployable test","Interviews with experts","N/A","Interviews with experts","Definition problem statement/use case  , Draft TPP","Technical/funding agencies , Academia/researchers, Clinicians, Test developers, Other","Global Alliance for Vaccines and Immunisation (GAVI) Fund","yes","Database search"]
["2019-02-11","PATH","Target Product Profile: Schistosomiasis Surveillance Diagnostic - schistosoma genus-specific antibody lateral flow test post-elimination surveillance",2015,"Report","Schistomiasis","Neglected tropical diseases","A lateral flow test","Interviews with experts, Field observations, Literature, Guidelines, Available data","Literature","No scoping phase reported","N/A ","N/A","no","no","Website search "]
["2019-02-11","WHO, FIND, Medecins sans Frontiers","A Multiplex Multi-Analyte Diagnostic Platform",null,"Report","Fever","Fever","A generic assay cartridge","Interviews with experts, Surveys with experts/expert opinion","No input sources reported","No scoping phase reported","Interview with stakeholders, Draft TPP, Delphi-like approach to gauge stakeholders’ agreement with the TPP, Feedback from the consultation (e.g. survey, meeting, expert opinion) is incorporated into the final TPPs, Consensus/public meeting","N/A","MSF, FIND, WHO","yes","Website search "]

{"sheet":"Input TPP scoping phase source","index":1,"n_rows":48,"n_cols":23,"rows_kept":48,"merged":[[0,2,0,13]]}
[null,null,"Input source to populate scoping phase"]
["Authors","Article title","Literature ","Interviews with experts","Expert opinion","Ethnographic interviews","Reports","Questionnaire provided to expert","Field research","Policies","Websites of developers","Data available","No scoping phase reported","N/A","More than 1 input source?","% STUDIES WITH 1 INPUT SOURCE","% STUDIES WITH >1 INPUT SOURCE",null,null,"Single source",null,null,"Which type of literature?"]
["Chua, A. P., I.: Nuebling, C. M.: Wood, D.: Moussy, F.","Update on Zika Diagnostic Tests and WHO's Related Activities",{"$f":"IF(ISNUMBER(SEARCH(\"Literature\",'Data extraction-synthesis'!K2)),\"X\",\"\")","v":""},{"$f":"IF(ISNUMBER(SEARCH(\"Interviews with experts\",'Data extraction-synthesis'!K2)),\"X\",\"\")","v":""},{"$f":"IF(ISNUMBER(SEARCH(\"Survey with experts/Expert opinion\",'Data extraction-synthesis'!K2)),\"X\",\"\")","v":""},{"$f":"IF(ISNUMBER(SEARCH(\"Ethnographic interviews\",'Data extraction-synthesis'!K2)),\"X\",\"\")","v":""},{"$f":"IF(ISNUMBER(SEARCH(\"Reports\",'Data extraction-synthesis'!K2)),\"X\",\"\")","v":""},{"$f":"IF(ISNUMBER(SEARCH(\"Questionnaire provided to expert\",'Data extraction-synthesis'!K2)),\"X\",\"\")","v":""},{"$f":"IF(ISNUMBER(SEARCH(\"Field research\",'Data extraction-synthesis'!K2)),\"X\",\"\")","v":""},{"$f":"IF(ISNUMBER(SEARCH(\"Policies\",'Data extraction-synthesis'!K2)),\"X\",\"\")","v":""},{"$f":"IF(ISNUMBER(SEARCH(\"Websites of developers\",'Data extraction-synthesis'!K2)),\"X\",\"\")","v":""},{"$f":"IF(ISNUMBER(SEARCH(\"Data available\",'Data extraction-synthesis'!K2)),\"X\",\"\")","v":""},{"$f":"IF(ISNUMBER(SEARCH(\"No scoping phase reported\",'Data extraction-synthesis'!K2)),\"X\",\"\")","v":"X"},{"$f":"IF(ISNUMBER(SEARCH(\"N/A\",'Data extraction-synthesis'!K2)),\"X\",\"\")","v":""},{"$f":"IF(OR(N3=\"X\",M3=\"X\"),\"N/A\",IF((COUNTIF(C3:N3,\"X\"))>1,\"YES\",\"NO\"))","v":"N/A"},{"$f":"COUNTIF(O3:O46,\"NO\")","v":15},{"$f":"COUNTIF(O3:O46,\"YES\")","v":7}]
["Denkinger, C. M. D., D.: Schito, M.: Wells, W.: Cobelens, F.: Pai, M.: Zignol, M.: Cirillo, D. M.: Alland, D.: Casenghi, M.: Gallarda, J.: Boehme, C. C.: Perkins, M. D","Target Product Profile of a Molecular Drug-Susceptibility Test for Use in Microscopy Centers",{"$f":"IF(ISNUMBER(SEARCH(\"Literature\",'Data extraction-synthesis'!K3)),\"X\",\"\")","v":"X"},{"$f":"IF(ISNUMBER(SEARCH(\"Interviews with experts\",'Data extraction-synthesis'!K3)),\"X\",\"\")","v":""},{"$f":"IF(ISNUMBER(SEARCH(\"Survey with experts/Expert opinion\",'Data extraction-synthesis'!K3)),\"X\",\"\")","v":"X"},{"$f":"IF(ISNUMBER(SEARCH(\"Ethnographic interviews\",'Data extraction-synthesis'!K3)),\"X\",\"\")","v":""},{"$f":"IF(ISNUMBER(SEARCH(\"Reports\",'Data extraction-synthesis'!K3)),\"X\",\"\")","v":""},{"$f":"IF(ISNUMBER(SEARCH(\"Questionnaire provided to expert\",'Data extraction-synthesis'!K3)),\"X\",\"\")","v":""},{"$f":"IF(ISNUMBER(SEARCH(\"Field research\",'Data extraction-synthesis'!K3)),\"X\",\"\")","v":""},{"$f":"IF(ISNUMBER(SEARCH(\"Policies\",'Data extraction-synthesis'!K3)),\"X\",\"\")","v":""},{"$f":"IF(ISNUMBER(SEARCH(\"Websites of developers\",'Data extraction-synthesis'!K3)),\"X\",\"\")","v":""},{"$f":"IF(ISNUMBER(SEARCH(\"Data available\",'Data extraction-synthesis'!K3)),\"X\",\"\")","v":"X"},{"$f":"IF(ISNUMBER(SEARCH(\"No scoping phase reported\",'Data extraction-synthesis'!K3)),\"X\",\"\")","v":""},{"$f":"IF(ISNUMBER(SEARCH(\"N/A\",'Data extraction-synthesis'!K3)),\"X\",\"\")","v":""},"YES",{"$f":"+COUNTIF(O3:O46,\"N/A\")","v":22},{"$f":"44-P4","v":22},{"$nulls":5},"It is only mentioned literature search"]
["Denkinger, C. M. K., Sandra V.: Cirillo, Daniela Maria: Casenghi, Martina: Shinnick, Thomas: Weyer, Karin: Gilpin, Chris: Boehme, Catharina C.: Schito, Marco: Kimerling, Michael: Pai, Madhuka","Defining the needs for next generation assays for tuberculosis",{"$f":"IF(ISNUMBER(SEARCH(\"Literature\",'Data extraction-synthesis'!K4)),\"X\",\"\")","v":"X"},{"$f":"IF(ISNUMBER(SEARCH(\"Interviews with experts\",'Data extraction-synthesis'!K4)),\"X\",\"\")","v":""},{"$f":"IF(ISNUMBER(SEARCH(\"Survey with experts/Expert opinion\",'Data extraction-synthesis'!K4)),\"X\",\"\")","v":"X"},{"$f":"IF(ISNUMBER(SEARCH(\"Ethnographic interviews\",'Data extraction-synthesis'!K4)),\"X\",\"\")","v":""},{"$f":"IF(ISNUMBER(SEARCH(\"Reports\",'Data extraction-synthesis'!K4)),\"X\",\"\")","v":"X"},{"$f":"IF(ISNUMBER(SEARCH(\"Questionnaire provided to expert\",'Data extraction-synthesis'!K4)),\"X\",\"\")","v":""},{"$f":"IF(ISNUMBER(SEARCH(\"Field research\",'Data extraction-synthesis'!K4)),\"X\",\"\")","v":""},{"$f":"IF(ISNUMBER(SEARCH(\"Policies\",'Data extraction-synthesis'!K4)),\"X\",\"\")","v":""},{"$f":"IF(ISNUMBER(SEARCH(\"Websites of developers\",'Data extraction-synthesis'!K4)),\"X\",\"\")","v":""},{"$f":"IF(ISNUMBER(SEARCH(\"Data available\",'Data extraction-synthesis'!K4)),\"X\",\"\")","v":""},{"$f":"IF(ISNUMBER(SEARCH(\"No scoping phase reported\",'Data extraction-synthesis'!K4)),\"X\",\"\")","v":""},{"$f":"IF(ISNUMBER(SEARCH(\"N/A\",'Data extraction-synthesis'!K4)),\"X\",\"\")","v":""},"YES",{"$nulls":7},"It only mentioned literature search"]
["DIAMETER Project, PATH","Point-of-Care Malaria Infection Detection Test For rapid detection of low-density, subclinical malaria infections",{"$f":"IF(ISNUMBER(SEARCH(\"Literature\",'Data extraction-synthesis'!K5)),\"X\",\"\")","v":""},{"$f":"IF(ISNUMBER(SEARCH(\"Interviews with experts\",'Data extraction-synthesis'!K5)),\"X\",\"\")","v":""},{"$f":"IF(ISNUMBER(SEARCH(\"Survey with experts/Expert opinion\",'Data extraction-synthesis'!K5)),\"X\",\"\")","v":""},{"$f":"IF(ISNUMBER(SEARCH(\"Ethnographic interviews\",'Data extraction-synthesis'!K5)),\"X\",\"\")","v":""},{"$f":"IF(ISNUMBER(SEARCH(\"Reports\",'Data extraction-synthesis'!K5)),\"X\",\"\")","v":""},{"$f":"IF(ISNUMBER(SEARCH(\"Questionnaire provided to expert\",'Data extraction-synthesis'!K5)),\"X\",\"\")","v":""},{"$f":"IF(ISNUMBER(SEARCH(\"Field research\",'Data extraction-synthesis'!K5)),\"X\",\"\")","v":""},{"$f":"IF(ISNUMBER(SEARCH(\"Policies\",'Data extraction-synthesis'!K5)),\"X\",\"\")","v":""},{"$f":"IF(ISNUMBER(SEARCH(\"Websites of developers\",'Data extraction-synthesis'!K5)),\"X\",\"\")","v":""},{"$f":"IF(ISNUMBER(SEARCH(\"Data available\",'Data extraction-synthesis'!K5)),\"X\",\"\")","v":""},{"$f":"IF(ISNUMBER(SEARCH(\"No scoping phase reported\",'Data extraction-synthesis'!K5)),\"X\",\"\")","v":"X"},{"$f":"IF(ISNUMBER(SEARCH(\"N/A\",'Data extraction-synthesis'!K5)),\"X\",\"\")","v":""},"N/A"]
["Ding, X. C. A., Maria Paz: Baird, J. Kevin: Cheng, Qin: Cunningham, Jane: Dhorda, Mehul: Drakeley, Chris: Felger, Ingrid: Gamboa, Dionicia: Harbers, Matthias: Herrera, Socrates: Lucchi, Naomi: Mayor, Alfredo: Mueller, Ivo: Sattabongkot, Jetsumon: Ratsimbason, Arsène: Richards, Jack: Tanner, Marcel: González, Iveth J.","Defining the next generation of Plasmodium vivax diagnostic tests for control and elimination: Target product profiles",{"$f":"IF(ISNUMBER(SEARCH(\"Literature\",'Data extraction-synthesis'!K6)),\"X\",\"\")","v":""},{"$f":"IF(ISNUMBER(SEARCH(\"Interviews with experts\",'Data extraction-synthesis'!K6)),\"X\",\"\")","v":""},{"$f":"IF(ISNUMBER(SEARCH(\"Survey with experts/Expert opinion\",'Data extraction-synthesis'!K6)),\"X\",\"\")","v":"X"},{"$f":"IF(ISNUMBER(SEARCH(\"Ethnographic interviews\",'Data extraction-synthesis'!K6)),\"X\",\"\")","v":""},{"$f":"IF(ISNUMBER(SEARCH(\"Reports\",'Data extraction-synthesis'!K6)),\"X\",\"\")","v":""},{"$f":"IF(ISNUMBER(SEARCH(\"Questionnaire provided to expert\",'Data extraction-synthesis'!K6)),\"X\",\"\")","v":""},{"$f":"IF(ISNUMBER(SEARCH(\"Field research\",'Data extraction-synthesis'!K6)),\"X\",\"\")","v":""},{"$f":"IF(ISNUMBER(SEARCH(\"Policies\",'Data extraction-synthesis'!K6)),\"X\",\"\")","v":""},{"$f":"IF(ISNUMBER(SEARCH(\"Websites of developers\",'Data extraction-synthesis'!K6)),\"X\",\"\")","v":""},{"$f":"IF(ISNUMBER(SEARCH(\"Data available\",'Data extraction-synthesis'!K6)),\"X\",\"\")","v":""},{"$f":"IF(ISNUMBER(SEARCH(\"No scoping phase reported\",'Data extraction-synthesis'!K6)),\"X\",\"\")","v":""},{"$f":"IF(ISNUMBER(SEARCH(\"N/A\",'Data extraction-synthesis'!K6)),\"X\",\"\")","v":""},"NO",{"$nulls":4},"Expert opinion"]
["Dittrich, S. T., B. T.: Moussy, F.: Chua, A.: Zorzet, A.: Tangden, T.: Dolinger, D. L.: Page, A. L.: Crump, J. A.: Valerie, D.: Bassat, Q.: Lubell, Y.: Heinrich, N.: Newton, P. N.: Rodwell, T.: Gonzalez, I. J.","Target Product Profile for a Diagnostic Assay to Differentiate between Bacterial and Non-Bacterial Infections to Guide Antimicrobials Use in Resource-Limited Settings: An Expert Consensus",{"$f":"IF(ISNUMBER(SEARCH(\"Literature\",'Data extraction-synthesis'!K7)),\"X\",\"\")","v":"X"},{"$f":"IF(ISNUMBER(SEARCH(\"Interviews with experts\",'Data extraction-synthesis'!K7)),\"X\",\"\")","v":""},{"$f":"IF(ISNUMBER(SEARCH(\"Survey with experts/Expert opinion\",'Data extraction-synthesis'!K7)),\"X\",\"\")","v":""},{"$f":"IF(ISNUMBER(SEARCH(\"Ethnographic interviews\",'Data extraction-synthesis'!K7)),\"X\",\"\")","v":""},{"$f":"IF(ISNUMBER(SEARCH(\"Reports\",'Data extraction-synthesis'!K7)),\"X\",\"\")","v":""},{"$f":"IF(ISNUMBER(SEARCH(\"Questionnaire provided to expert\",'Data extraction-synthesis'!K7)),\"X\",\"\")","v":""},{"$f":"IF(ISNUMBER(SEARCH(\"Field research\",'Data extraction-synthesis'!K7)),\"X\",\"\")","v":""},{"$f":"IF(ISNUMBER(SEARCH(\"Policies\",'Data extraction-synthesis'!K7)),\"X\",\"\")","v":""},{"$f":"IF(ISNUMBER(SEARCH(\"Websites of developers\",'Data extraction-synthesis'!K7)),\"X\",\"\")","v":""},{"$f":"IF(ISNUMBER(SEARCH(\"Data available\",'Data extraction-synthesis'!K7)),\"X\",\"\")","v":""},{"$f":"IF(ISNUMBER(SEARCH(\"No scoping phase reported\",'Data extraction-synthesis'!K7)),\"X\",\"\")","v":""},{"$f":"IF(ISNUMBER(SEARCH(\"N/A\",'Data extraction-synthesis'!K7)),\"X\",\"\")","v":""},"NO",{"$nulls":4},"Literature",null,null,"It mentions review of current biomarker landscape while citing a lit reference"]
["FIND","High-priority target product profile for hepatitis C diagnosis in decentralized settings: Report of a consensus meeting. ",{"$f":"IF(ISNUMBER(SEARCH(\"Literature\",'Data extraction-synthesis'!K8)),\"X\",\"\")","v":""},{"$f":"IF(ISNUMBER(SEARCH(\"Interviews with experts\",'Data extraction-synthesis'!K8)),\"X\",\"\")","v":""},{"$f":"IF(ISNUMBER(SEARCH(\"Survey with experts/Expert opinion\",'Data extraction-synthesis'!K8)),\"X\",\"\")","v":"X"},{"$f":"IF(ISNUMBER(SEARCH(\"Ethnographic interviews\",'Data extraction-synthesis'!K8)),\"X\",\"\")","v":""},{"$f":"IF(ISNUMBER(SEARCH(\"Reports\",'Data extraction-synthesis'!K8)),\"X\",\"\")","v":""},{"$f":"IF(ISNUMBER(SEARCH(\"Questionnaire provided to expert\",'Data extraction-synthesis'!K8)),\"X\",\"\")","v":""},{"$f":"IF(ISNUMBER(SEARCH(\"Field research\",'Data extraction-synthesis'!K8)),\"X\",\"\")","v":""},{"$f":"IF(ISNUMBER(SEARCH(\"Policies\",'Data extraction-synthesis'!K8)),\"X\",\"\")","v":""},{"$f":"IF(ISNUMBER(SEARCH(\"Websites of developers\",'Data extraction-synthesis'!K8)),\"X\",\"\")","v":""},{"$f":"IF(ISNUMBER(SEARCH(\"Data available\",'Data extraction-synthesis'!K8)),\"X\",\"\")","v":""},{"$f":"IF(ISNUMBER(SEARCH(\"No scoping phase reported\",'Data extraction-synthesis'!K8)),\"X\",\"\")","v":""},{"$f":"IF(ISNUMBER(SEARCH(\"N/A\",'Data extraction-synthesis'!K8)),\"X\",\"\")","v":""},"NO",{"$nulls":4},"Expert opinion"]
["Gal, M. F., N. A.: Hood, K.: Villacian, J.: Goossens, H.: Watkins, A.: Butler, C. C.","Matching diagnostics development to clinical need: Target product profile development for a point of care test for community-acquired lower respiratory tract infection",{"$f":"IF(ISNUMBER(SEARCH(\"Literature\",'Data extraction-synthesis'!K9)),\"X\",\"\")","v":""},{"$f":"IF(ISNUMBER(SEARCH(\"Interviews with experts\",'Data extraction-synthesis'!K9)),\"X\",\"\")","v":""},{"$f":"IF(ISNUMBER(SEARCH(\"Survey with experts/Expert opinion\",'Data extraction-synthesis'!K9)),\"X\",\"\")","v":"X"},{"$f":"IF(ISNUMBER(SEARCH(\"Ethnographic interviews\",'Data extraction-synthesis'!K9)),\"X\",\"\")","v":""},{"$f":"IF(ISNUMBER(SEARCH(\"Reports\",'Data extraction-synthesis'!K9)),\"X\",\"\")","v":""},{"$f":"IF(ISNUMBER(SEARCH(\"Questionnaire provided to expert\",'Data extraction-synthesis'!K9)),\"X\",\"\")","v":""},{"$f":"IF(ISNUMBER(SEARCH(\"Field research\",'Data extraction-synthesis'!K9)),\"X\",\"\")","v":""},{"$f":"IF(ISNUMBER(SEARCH(\"Policies\",'Data extraction-synthesis'!K9)),\"X\",\"\")","v":""},{"$f":"IF(ISNUMBER(SEARCH(\"Websites of developers\",'Data extraction-synthesis'!K9)),\"X\",\"\")","v":""},{"$f":"IF(ISNUMBER(SEARCH(\"Data available\",'Data extraction-synthesis'!K9)),\"X\",\"\")","v":""},{"$f":"IF(ISNUMBER(SEARCH(\"No scoping phase reported\",'Data extraction-synthesis'!K9)),\"X\",\"\")","v":""},{"$f":"IF(ISNUMBER(SEARCH(\"N/A\",'Data extraction-synthesis'!K9)),\"X\",\"\")","v":""},"NO",{"$nulls":4},"Expert opinion"]
["Lim, M. D. B., S. J.: Belizario, V. Y., Jr.: Gay-Andrieu, F.: Gilleard, J.: Levecke, B.: Lieshout, L. van: Medley, G. F.: Mekonnen, Z.: Mirams, G.: Njenga, S. M.: Odiere, M. R.: Rudge, J. W.: Stuyver, L.: Vercruysse, J.: Vlaminck, J.: Walson, J. L. ","Diagnostic tools for soil-transmitted helminths control and elimination programs: a pathway for diagnostic product development",{"$f":"IF(ISNUMBER(SEARCH(\"Literature\",'Data extraction-synthesis'!K10)),\"X\",\"\")","v":"X"},{"$f":"IF(ISNUMBER(SEARCH(\"Interviews with experts\",'Data extraction-synthesis'!K10)),\"X\",\"\")","v":""},{"$f":"IF(ISNUMBER(SEARCH(\"Survey with experts/Expert opinion\",'Data extraction-synthesis'!K10)),\"X\",\"\")","v":"X"},{"$f":"IF(ISNUMBER(SEARCH(\"Ethnographic interviews\",'Data extraction-synthesis'!K10)),\"X\",\"\")","v":""},{"$f":"IF(ISNUMBER(SEARCH(\"Reports\",'Data extraction-synthesis'!K10)),\"X\",\"\")","v":""},{"$f":"IF(ISNUMBER(SEARCH(\"Questionnaire provided to expert\",'Data extraction-synthesis'!K10)),\"X\",\"\")","v":""},{"$f":"IF(ISNUMBER(SEARCH(\"Field research\",'Data extraction-synthesis'!K10)),\"X\",\"\")","v":""},{"$f":"IF(ISNUMBER(SEARCH(\"Policies\",'Data extraction-synthesis'!K10)),\"X\",\"\")","v":""},{"$f":"IF(ISNUMBER(SEARCH(\"Websites of developers\",'Data extraction-synthesis'!K10)),\"X\",\"\")","v":""},{"$f":"IF(ISNUMBER(SEARCH(\"Data available\",'Data extraction-synthesis'!K10)),\"X\",\"\")","v":""},{"$f":"IF(ISNUMBER(SEARCH(\"No scoping phase reported\",'Data extraction-synthesis'!K10)),\"X\",\"\")","v":""},{"$f":"IF(ISNUMBER(SEARCH(\"N/A\",'Data extraction-synthesis'!K10)),\"X\",\"\")","v":""},"YES",{"$nulls":7},"They only cite specific literature"]
["Nsanzabana, C. A., Frederic: Beck, Hans-Peter: Ding, Xavier C.: Kamau, Edwin: Krishna, Sanjeev: Legrand, Eric: Lucchi, Naomi: Miotto, Olivo: Nag, Sidsel: Noedl, Harald: Roper, Cally: Rosenthal, Philip J.: Schallig, Henk D. F. H.: Taylor, Steve M.: Volkman, Sarah K.: Gonzalez, Iveth J.","Molecular assays for antimalarial drug resistance surveillance: A target product profile",{"$f":"IF(ISNUMBER(SEARCH(\"Literature\",'Data extraction-synthesis'!K11)),\"X\",\"\")","v":"X"},{"$f":"IF(ISNUMBER(SEARCH(\"Interviews with experts\",'Data extraction-synthesis'!K11)),\"X\",\"\")","v":""},{"$f":"IF(ISNUMBER(SEARCH(\"Survey with experts/Expert opinion\",'Data extraction-synthesis'!K11)),\"X\",\"\")","v":""},{"$f":"IF(ISNUMBER(SEARCH(\"Ethnographic interviews\",'Data extraction-synthesis'!K11)),\"X\",\"\")","v":""},{"$f":"IF(ISNUMBER(SEARCH(\"Reports\",'Data extraction-synthesis'!K11)),\"X\",\"\")","v":""},{"$f":"IF(ISNUMBER(SEARCH(\"Questionnaire provided to expert\",'Data extraction-synthesis'!K11)),\"X\",\"\")","v":""},{"$f":"IF(ISNUMBER(SEARCH(\"Field research\",'Data extraction-synthesis'!K11)),\"X\",\"\")","v":""},{"$f":"IF(ISNUMBER(SEARCH(\"Policies\",'Data extraction-synthesis'!K11)),\"X\",\"\")","v":""},{"$f":"IF(ISNUMBER(SEARCH(\"Websites of developers\",'Data extraction-synthesis'!K11)),\"X\",\"\")","v":""},{"$f":"IF(ISNUMBER(SEARCH(\"Data available\",'Data extraction-synthesis'!K11)),\"X\",\"\")","v":""},{"$f":"IF(ISNUMBER(SEARCH(\"No scoping phase reported\",'Data extraction-synthesis'!K11)),\"X\",\"\")","v":""},{"$f":"IF(ISNUMBER(SEARCH(\"N/A\",'Data extraction-synthesis'!K11)),\"X\",\"\")","v":""},"NO",{"$nulls":4},"Literature",null,null,"They mention a lanscape analysis, which  entails a literature review"]
["Porras, A. I. Y., Z. E.: Altcheh, J.: Britto, C.: Chaves, G. C.: Flevaud, L.: Martins, O. A.: Ribeiro, I.: Schijman, A. G.: Shikanai-Yasuda, M. A.: Sosa-Estani, S.: Stobbaerts, E.: Zicker, F.","Target Product Profile (TPP) for Chagas Disease Point-of-Care Diagnosis and Assessment of Response to Treatmen",{"$f":"IF(ISNUMBER(SEARCH(\"Literature\",'Data extraction-synthesis'!K12)),\"X\",\"\")","v":""},{"$f":"IF(ISNUMBER(SEARCH(\"Interviews with experts\",'Data extraction-synthesis'!K12)),\"X\",\"\")","v":""},{"$f":"IF(ISNUMBER(SEARCH(\"Survey with experts/Expert opinion\",'Data extraction-synthesis'!K12)),\"X\",\"\")","v":"X"},{"$f":"IF(ISNUMBER(SEARCH(\"Ethnographic interviews\",'Data extraction-synthesis'!K12)),\"X\",\"\")","v":""},{"$f":"IF(ISNUMBER(SEARCH(\"Reports\",'Data extraction-synthesis'!K12)),\"X\",\"\")","v":""},{"$f":"IF(ISNUMBER(SEARCH(\"Questionnaire provided to expert\",'Data extraction-synthesis'!K12)),\"X\",\"\")","v":""},{"$f":"IF(ISNUMBER(SEARCH(\"Field research\",'Data extraction-synthesis'!K12)),\"X\",\"\")","v":""},{"$f":"IF(ISNUMBER(SEARCH(\"Policies\",'Data extraction-synthesis'!K12)),\"X\",\"\")","v":""},{"$f":"IF(ISNUMBER(SEARCH(\"Websites of developers\",'Data extraction-synthesis'!K12)),\"X\",\"\")","v":""},{"$f":"IF(ISNUMBER(SEARCH(\"Data available\",'Data extraction-synthesis'!K12)),\"X\",\"\")","v":""},{"$f":"IF(ISNUMBER(SEARCH(\"No scoping phase reported\",'Data extraction-synthesis'!K12)),\"X\",\"\")","v":""},{"$f":"IF(ISNUMBER(SEARCH(\"N/A\",'Data extraction-synthesis'!K12)),\"X\",\"\")","v":""},"NO",{"$nulls":4},"Expert opinion"]
["Reipold, E. I. E., Philippa: Trianni, Alessandra: Panneer, Nivedha: Krakower, Douglas: Ongarello, Stefano: Roberts, Teri: Miller, Veronica: Denkinger, Claudia","Optimising diagnosis of viraemic hepatitis C infection: the development of a target product profile",{"$f":"IF(ISNUMBER(SEARCH(\"Literature\",'Data extraction-synthesis'!K13)),\"X\",\"\")","v":""},{"$f":"IF(ISNUMBER(SEARCH(\"Interviews with experts\",'Data extraction-synthesis'!K13)),\"X\",\"\")","v":""},{"$f":"IF(ISNUMBER(SEARCH(\"Survey with experts/Expert opinion\",'Data extraction-synthesis'!K13)),\"X\",\"\")","v":"X"},{"$f":"IF(ISNUMBER(SEARCH(\"Ethnographic interviews\",'Data extraction-synthesis'!K13)),\"X\",\"\")","v":""},{"$f":"IF(ISNUMBER(SEARCH(\"Reports\",'Data extraction-synthesis'!K13)),\"X\",\"\")","v":""},{"$f":"IF(ISNUMBER(SEARCH(\"Questionnaire provided to expert\",'Data extraction-synthesis'!K13)),\"X\",\"\")","v":""},{"$f":"IF(ISNUMBER(SEARCH(\"Field research\",'Data extraction-synthesis'!K13)),\"X\",\"\")","v":""},{"$f":"IF(ISNUMBER(SEARCH(\"Policies\",'Data extraction-synthesis'!K13)),\"X\",\"\")","v":""},{"$f":"IF(ISNUMBER(SEARCH(\"Websites of developers\",'Data extraction-synthesis'!K13)),\"X\",\"\")","v":""},{"$f":"IF(ISNUMBER(SEARCH(\"Data available\",'Data extraction-synthesis'!K13)),\"X\",\"\")","v":""},{"$f":"IF(ISNUMBER(SEARCH(\"No scoping phase reported\",'Data extraction-synthesis'!K13)),\"X\",\"\")","v":""},{"$f":"IF(ISNUMBER(SEARCH(\"N/A\",'Data extraction-synthesis'!K13)),\"X\",\"\")","v":""},"NO",{"$nulls":4},"Expert opinion"]
["Solomon, A. W. E., D.: Bailey, R. L.: Blake, I. M.: Brooker, S.: Chen, J. X.: Chen, J. H.: Churcher, T. S.: Drakeley, C. J.: Edwards, T.: Fenwick, A.: French, M.: Gabrielli, A. F.: Grassly, N. C.: Harding-Esch, E. M.: Holland, M. J.: Koukounari, A.: Lammie, P. J.: Leslie, J.: Mabey, D. C.: Rhajaoui, M.: Secor, W. E.: Stothard, J. R.: Wei, H.: Willingham, A. L.: Zhou, X. N.: Peeling, R. W.","A diagnostics platform for the integrated mapping, monitoring, and surveillance of neglected tropical diseases: Rationale and target product profiles",{"$f":"IF(ISNUMBER(SEARCH(\"Literature\",'Data extraction-synthesis'!K14)),\"X\",\"\")","v":""},{"$f":"IF(ISNUMBER(SEARCH(\"Interviews with experts\",'Data extraction-synthesis'!K14)),\"X\",\"\")","v":""},{"$f":"IF(ISNUMBER(SEARCH(\"Survey with experts/Expert opinion\",'Data extraction-synthesis'!K14)),\"X\",\"\")","v":""},{"$f":"IF(ISNUMBER(SEARCH(\"Ethnographic interviews\",'Data extraction-synthesis'!K14)),\"X\",\"\")","v":""},{"$f":"IF(ISNUMBER(SEARCH(\"Reports\",'Data extraction-synthesis'!K14)),\"X\",\"\")","v":""},{"$f":"IF(ISNUMBER(SEARCH(\"Questionnaire provided to expert\",'Data extraction-synthesis'!K14)),\"X\",\"\")","v":""},{"$f":"IF(ISNUMBER(SEARCH(\"Field research\",'Data extraction-synthesis'!K14)),\"X\",\"\")","v":""},{"$f":"IF(ISNUMBER(SEARCH(\"Policies\",'Data extraction-synthesis'!K14)),\"X\",\"\")","v":""},{"$f":"IF(ISNUMBER(SEARCH(\"Websites of developers\",'Data extraction-synthesis'!K14)),\"X\",\"\")","v":""},{"$f":"IF(ISNUMBER(SEARCH(\"Data available\",'Data extraction-synthesis'!K14)),\"X\",\"\")","v":""},{"$f":"IF(ISNUMBER(SEARCH(\"No scoping phase reported\",'Data extraction-synthesis'!K14)),\"X\",\"\")","v":"X"},{"$f":"IF(ISNUMBER(SEARCH(\"N/A\",'Data extraction-synthesis'!K14)),\"X\",\"\")","v":""},"N/A"]
["Toskin, I. M., M.: Peeling, R. W.: Blondeel, K.: Cordero, J.: Kiarie, J.","Advancing prevention of sexually transmitted infections through point-of-care testing: target product profiles and landscape analysis",{"$f":"IF(ISNUMBER(SEARCH(\"Literature\",'Data extraction-synthesis'!K15)),\"X\",\"\")","v":"X"},{"$f":"IF(ISNUMBER(SEARCH(\"Interviews with experts\",'Data extraction-synthesis'!K15)),\"X\",\"\")","v":"X"},{"$f":"IF(ISNUMBER(SEARCH(\"Survey with experts/Expert opinion\",'Data extraction-synthesis'!K15)),\"X\",\"\")","v":""},{"$f":"IF(ISNUMBER(SEARCH(\"Ethnographic interviews\",'Data extraction-synthesis'!K15)),\"X\",\"\")","v":""},{"$f":"IF(ISNUMBER(SEARCH(\"Reports\",'Data extraction-synthesis'!K15)),\"X\",\"\")","v":"X"},{"$f":"IF(ISNUMBER(SEARCH(\"Questionnaire provided to expert\",'Data extraction-synthesis'!K15)),\"X\",\"\")","v":""},{"$f":"IF(ISNUMBER(SEARCH(\"Field research\",'Data extraction-synthesis'!K15)),\"X\",\"\")","v":""},{"$f":"IF(ISNUMBER(SEARCH(\"Policies\",'Data extraction-synthesis'!K15)),\"X\",\"\")","v":"X"},{"$f":"IF(ISNUMBER(SEARCH(\"Websites of developers\",'Data extraction-synthesis'!K15)),\"X\",\"\")","v":"X"},{"$f":"IF(ISNUMBER(SEARCH(\"Data available\",'Data extraction-synthesis'!K15)),\"X\",\"\")","v":""},{"$f":"IF(ISNUMBER(SEARCH(\"No scoping phase reported\",'Data extraction-synthesis'!K15)),\"X\",\"\")","v":""},{"$f":"IF(ISNUMBER(SEARCH(\"N/A\",'Data extraction-synthesis'!K15)),\"X\",\"\")","v":""},"YES",{"$nulls":7},"\"Rapid\" literature review, the authors reported keywords and databases searched + mention landscape analysis"]
["Donadeu, M. F., A. S.: Olliaro, P. L.: Abela-Ridder, B","Target product profiles for the diagnosis of Taenia solium taeniasis, neurocysticercosis and porcine cysticercosis",{"$f":"IF(ISNUMBER(SEARCH(\"Literature\",'Data extraction-synthesis'!K16)),\"X\",\"\")","v":""},{"$f":"IF(ISNUMBER(SEARCH(\"Interviews with experts\",'Data extraction-synthesis'!K16)),\"X\",\"\")","v":""},{"$f":"IF(ISNUMBER(SEARCH(\"Survey with experts/Expert opinion\",'Data extraction-synthesis'!K16)),\"X\",\"\")","v":"X"},{"$f":"IF(ISNUMBER(SEARCH(\"Ethnographic interviews\",'Data extraction-synthesis'!K16)),\"X\",\"\")","v":""},{"$f":"IF(ISNUMBER(SEARCH(\"Reports\",'Data extraction-synthesis'!K16)),\"X\",\"\")","v":""},{"$f":"IF(ISNUMBER(SEARCH(\"Questionnaire provided to expert\",'Data extraction-synthesis'!K16)),\"X\",\"\")","v":""},{"$f":"IF(ISNUMBER(SEARCH(\"Field research\",'Data extraction-synthesis'!K16)),\"X\",\"\")","v":""},{"$f":"IF(ISNUMBER(SEARCH(\"Policies\",'Data extraction-synthesis'!K16)),\"X\",\"\")","v":""},{"$f":"IF(ISNUMBER(SEARCH(\"Websites of developers\",'Data extraction-synthesis'!K16)),\"X\",\"\")","v":""},{"$f":"IF(ISNUMBER(SEARCH(\"Data available\",'Data extraction-synthesis'!K16)),\"X\",\"\")","v":""},{"$f":"IF(ISNUMBER(SEARCH(\"No scoping phase reported\",'Data extraction-synthesis'!K16)),\"X\",\"\")","v":""},{"$f":"IF(ISNUMBER(SEARCH(\"N/A\",'Data extraction-synthesis'!K16)),\"X\",\"\")","v":""},"NO",{"$nulls":4},"Expert opinion"]
["FIND","Target Product Profile for Tests for Recent HIV Infection",{"$f":"IF(ISNUMBER(SEARCH(\"Literature\",'Data extraction-synthesis'!K17)),\"X\",\"\")","v":""},{"$f":"IF(ISNUMBER(SEARCH(\"Interviews with experts\",'Data extraction-synthesis'!K17)),\"X\",\"\")","v":""},{"$f":"IF(ISNUMBER(SEARCH(\"Survey with experts/Expert opinion\",'Data extraction-synthesis'!K17)),\"X\",\"\")","v":"X"},{"$f":"IF(ISNUMBER(SEARCH(\"Ethnographic interviews\",'Data extraction-synthesis'!K17)),\"X\",\"\")","v":""},{"$f":"IF(ISNUMBER(SEARCH(\"Reports\",'Data extraction-synthesis'!K17)),\"X\",\"\")","v":""},{"$f":"IF(ISNUMBER(SEARCH(\"Questionnaire provided to expert\",'Data extraction-synthesis'!K17)),\"X\",\"\")","v":""},{"$f":"IF(ISNUMBER(SEARCH(\"Field research\",'Data extraction-synthesis'!K17)),\"X\",\"\")","v":""},{"$f":"IF(ISNUMBER(SEARCH(\"Policies\",'Data extraction-synthesis'!K17)),\"X\",\"\")","v":""},{"$f":"IF(ISNUMBER(SEARCH(\"Websites of developers\",'Data extraction-synthesis'!K17)),\"X\",\"\")","v":""},{"$f":"IF(ISNUMBER(SEARCH(\"Data available\",'Data extraction-synthesis'!K17)),\"X\",\"\")","v":""},{"$f":"IF(ISNUMBER(SEARCH(\"No scoping phase reported\",'Data extraction-synthesis'!K17)),\"X\",\"\")","v":""},{"$f":"IF(ISNUMBER(SEARCH(\"N/A\",'Data extraction-synthesis'!K17)),\"X\",\"\")","v":""},"NO",{"$nulls":4},"Expert opinion"]
["FIND","Target Product Profile: Rapid test for diagnosis of malaria and screening for hyman African trypanosomiasis (HAT)",{"$f":"IF(ISNUMBER(SEARCH(\"Literature\",'Data extraction-synthesis'!K18)),\"X\",\"\")","v":""},{"$f":"IF(ISNUMBER(SEARCH(\"Interviews with experts\",'Data extraction-synthesis'!K18)),\"X\",\"\")","v":""},{"$f":"IF(ISNUMBER(SEARCH(\"Survey with experts/Expert opinion\",'Data extraction-synthesis'!K18)),\"X\",\"\")","v":""},{"$f":"IF(ISNUMBER(SEARCH(\"Ethnographic interviews\",'Data extraction-synthesis'!K18)),\"X\",\"\")","v":""},{"$f":"IF(ISNUMBER(SEARCH(\"Reports\",'Data extraction-synthesis'!K18)),\"X\",\"\")","v":""},{"$f":"IF(ISNUMBER(SEARCH(\"Questionnaire provided to expert\",'Data extraction-synthesis'!K18)),\"X\",\"\")","v":""},{"$f":"IF(ISNUMBER(SEARCH(\"Field research\",'Data extraction-synthesis'!K18)),\"X\",\"\")","v":""},{"$f":"IF(ISNUMBER(SEARCH(\"Policies\",'Data extraction-synthesis'!K18)),\"X\",\"\")","v":""},{"$f":"IF(ISNUMBER(SEARCH(\"Websites of developers\",'Data extraction-synthesis'!K18)),\"X\",\"\")","v":""},{"$f":"IF(ISNUMBER(SEARCH(\"Data available\",'Data extraction-synthesis'!K18)),\"X\",\"\")","v":""},{"$f":"IF(ISNUMBER(SEARCH(\"No scoping phase reported\",'Data extraction-synthesis'!K18)),\"X\",\"\")","v":"X"},{"$f":"IF(ISNUMBER(SEARCH(\"N/A\",'Data extraction-synthesis'!K18)),\"X\",\"\")","v":""},"N/A"]
["PATH","Target Product Profile: HIV Self-Test Version 4.1: A White Paper on the Evaluation of Current HIV Rapid Tests and Development of Core Specifications for Next-Generation HIV Tests",{"$f":"IF(ISNUMBER(SEARCH(\"Literature\",'Data extraction-synthesis'!K19)),\"X\",\"\")","v":""},{"$f":"IF(ISNUMBER(SEARCH(\"Interviews with experts\",'Data extraction-synthesis'!K19)),\"X\",\"\")","v":""},{"$f":"IF(ISNUMBER(SEARCH(\"Survey with experts/Expert opinion\",'Data extraction-synthesis'!K19)),\"X\",\"\")","v":""},{"$f":"IF(ISNUMBER(SEARCH(\"Ethnographic interviews\",'Data extraction-synthesis'!K19)),\"X\",\"\")","v":""},{"$f":"IF(ISNUMBER(SEARCH(\"Reports\",'Data extraction-synthesis'!K19)),\"X\",\"\")","v":""},{"$f":"IF(ISNUMBER(SEARCH(\"Questionnaire provided to expert\",'Data extraction-synthesis'!K19)),\"X\",\"\")","v":""},{"$f":"IF(ISNUMBER(SEARCH(\"Field research\",'Data extraction-synthesis'!K19)),\"X\",\"\")","v":""},{"$f":"IF(ISNUMBER(SEARCH(\"Policies\",'Data extraction-synthesis'!K19)),\"X\",\"\")","v":""},{"$f":"IF(ISNUMBER(SEARCH(\"Websites of developers\",'Data extraction-synthesis'!K19)),\"X\",\"\")","v":""},{"$f":"IF(ISNUMBER(SEARCH(\"Data available\",'Data extraction-synthesis'!K19)),\"X\",\"\")","v":""},{"$f":"IF(ISNUMBER(SEARCH(\"No scoping phase reported\",'Data extraction-synthesis'!K19)),\"X\",\"\")","v":"X"},{"$f":"IF(ISNUMBER(SEARCH(\"N/A\",'Data extraction-synthesis'!K19)),\"X\",\"\")","v":""},"N/A"]
["PATH","Diagnostics for neglected tropical diseases: Defining the best tools through target product profiles",{"$f":"IF(ISNUMBER(SEARCH(\"Literature\",'Data extraction-synthesis'!K20)),\"X\",\"\")","v":"X"},{"$f":"IF(ISNUMBER(SEARCH(\"Interviews with experts\",'Data extraction-synthesis'!K20)),\"X\",\"\")","v":"X"},null,{"$f":"IF(ISNUMBER(SEARCH(\"Ethnographic interviews\",'Data extraction-synthesis'!K20)),\"X\",\"\")","v":""},{"$f":"IF(ISNUMBER(SEARCH(\"Reports\",'Data extraction-synthesis'!K20)),\"X\",\"\")","v":""},{"$f":"IF(ISNUMBER(SEARCH(\"Questionnaire provided to expert\",'Data extraction-synthesis'!K20)),\"X\",\"\")","v":""},{"$f":"IF(ISNUMBER(SEARCH(\"Field research\",'Data extraction-synthesis'!K20)),\"X\",\"\")","v":""},{"$f":"IF(ISNUMBER(SEARCH(\"Policies\",'Data extraction-synthesis'!K20)),\"X\",\"\")","v":""},{"$f":"IF(ISNUMBER(SEARCH(\"Websites of developers\",'Data extraction-synthesis'!K20)),\"X\",\"\")","v":""},{"$f":"IF(ISNUMBER(SEARCH(\"Data available\",'Data extraction-synthesis'!K20)),\"X\",\"\")","v":""},{"$f":"IF(ISNUMBER(SEARCH(\"No scoping phase reported\",'Data extraction-synthesis'!K20)),\"X\",\"\")","v":""},{"$f":"IF(ISNUMBER(SEARCH(\"N/A\",'Data extraction-synthesis'!K20)),\"X\",\"\")","v":""},"YES",{"$nulls":7},"It is mentioned review of the scientific literature"]
["PATH","Target Product Profile: Schistosomiasis Surveillance Diagnostic",{"$f":"IF(ISNUMBER(SEARCH(\"Literature\",'Data extraction-synthesis'!K21)),\"X\",\"\")","v":""},{"$f":"IF(ISNUMBER(SEARCH(\"Interviews with experts\",'Data extraction-synthesis'!K21)),\"X\",\"\")","v":""},{"$f":"IF(ISNUMBER(SEARCH(\"Survey with experts/Expert opinion\",'Data extraction-synthesis'!K21)),\"X\",\"\")","v":""},{"$f":"IF(ISNUMBER(SEARCH(\"Ethnographic interviews\",'Data extraction-synthesis'!K21)),\"X\",\"\")","v":""},{"$f":"IF(ISNUMBER(SEARCH(\"Reports\",'Data extraction-synthesis'!K21)),\"X\",\"\")","v":""},{"$f":"IF(ISNUMBER(SEARCH(\"Questionnaire provided to expert\",'Data extraction-synthesis'!K21)),\"X\",\"\")","v":""},{"$f":"IF(ISNUMBER(SEARCH(\"Field research\",'Data extraction-synthesis'!K21)),\"X\",\"\")","v":""},{"$f":"IF(ISNUMBER(SEARCH(\"Policies\",'Data extraction-synthesis'!K21)),\"X\",\"\")","v":""},{"$f":"IF(ISNUMBER(SEARCH(\"Websites of developers\",'Data extraction-synthesis'!K21)),\"X\",\"\")","v":""},{"$f":"IF(ISNUMBER(SEARCH(\"Data available\",'Data extraction-synthesis'!K21)),\"X\",\"\")","v":""},{"$f":"IF(ISNUMBER(SEARCH(\"No scoping phase reported\",'Data extraction-synthesis'!K21)),\"X\",\"\")","v":"X"},{"$f":"IF(ISNUMBER(SEARCH(\"N/A\",'Data extraction-synthesis'!K21)),\"X\",\"\")","v":""},"N/A"]
["UNICEF","UNICEF Target Product Profile Rapid E.coli Detection (version 2.0)",{"$f":"IF(ISNUMBER(SEARCH(\"Literature\",'Data extraction-synthesis'!#REF!)),\"X\",\"\")","v":""},{"$f":"IF(ISNUMBER(SEARCH(\"Interviews with experts\",'Data extraction-synthesis'!K22)),\"X\",\"\")","v":""},{"$f":"IF(ISNUMBER(SEARCH(\"Survey with experts/Expert opinion\",'Data extraction-synthesis'!#REF!)),\"X\",\"\")","v":""},{"$f":"IF(ISNUMBER(SEARCH(\"Ethnographic interviews\",'Data extraction-synthesis'!#REF!)),\"X\",\"\")","v":""},{"$f":"IF(ISNUMBER(SEARCH(\"Reports\",'Data extraction-synthesis'!#REF!)),\"X\",\"\")","v":""},{"$f":"IF(ISNUMBER(SEARCH(\"Questionnaire provided to expert\",'Data extraction-synthesis'!K22)),\"X\",\"\")","v":""},{"$f":"IF(ISNUMBER(SEARCH(\"Field research\",'Data extraction-synthesis'!K22)),\"X\",\"\")","v":""},{"$f":"IF(ISNUMBER(SEARCH(\"Policies\",'Data extraction-synthesis'!#REF!)),\"X\",\"\")","v":""},{"$f":"IF(ISNUMBER(SEARCH(\"Websites of developers\",'Data extraction-synthesis'!#REF!)),\"X\",\"\")","v":""},{"$f":"IF(ISNUMBER(SEARCH(\"Data available\",'Data extraction-synthesis'!K22)),\"X\",\"\")","v":""},"x",null,"N/A"]
["UNICEF","UNICEF Target Product Profile Rapid E.coli Detection (1.4)",{"$f":"IF(ISNUMBER(SEARCH(\"Literature\",'Data extraction-synthesis'!K22)),\"X\",\"\")","v":""},{"$f":"IF(ISNUMBER(SEARCH(\"Interviews with experts\",'Data extraction-synthesis'!K23)),\"X\",\"\")","v":""},{"$f":"IF(ISNUMBER(SEARCH(\"Survey with experts/Expert opinion\",'Data extraction-synthesis'!K22)),\"X\",\"\")","v":""},{"$f":"IF(ISNUMBER(SEARCH(\"Ethnographic interviews\",'Data extraction-synthesis'!K22)),\"X\",\"\")","v":""},{"$f":"IF(ISNUMBER(SEARCH(\"Reports\",'Data extraction-synthesis'!K22)),\"X\",\"\")","v":""},{"$f":"IF(ISNUMBER(SEARCH(\"Questionnaire provided to expert\",'Data extraction-synthesis'!K23)),\"X\",\"\")","v":""},{"$f":"IF(ISNUMBER(SEARCH(\"Field research\",'Data extraction-synthesis'!K23)),\"X\",\"\")","v":""},{"$f":"IF(ISNUMBER(SEARCH(\"Policies\",'Data extraction-synthesis'!K22)),\"X\",\"\")","v":""},{"$f":"IF(ISNUMBER(SEARCH(\"Websites of developers\",'Data extraction-synthesis'!K22)),\"X\",\"\")","v":""},{"$f":"IF(ISNUMBER(SEARCH(\"Data available\",'Data extraction-synthesis'!K23)),\"X\",\"\")","v":""},"x",null,"N/A"]
["WHO","High-priority target product profile for new tubercolosis diagnostics: report of a consensus meeting",{"$f":"IF(ISNUMBER(SEARCH(\"Literature\",'Data extraction-synthesis'!K24)),\"X\",\"\")","v":""},{"$f":"IF(ISNUMBER(SEARCH(\"Interviews with experts\",'Data extraction-synthesis'!K24)),\"X\",\"\")","v":""},{"$f":"IF(ISNUMBER(SEARCH(\"Survey with experts/Expert opinion\",'Data extraction-synthesis'!K24)),\"X\",\"\")","v":"X"},{"$f":"IF(ISNUMBER(SEARCH(\"Ethnographic interviews\",'Data extraction-synthesis'!K24)),\"X\",\"\")","v":""},{"$f":"IF(ISNUMBER(SEARCH(\"Reports\",'Data extraction-synthesis'!K24)),\"X\",\"\")","v":""},{"$f":"IF(ISNUMBER(SEARCH(\"Questionnaire provided to expert\",'Data extraction-synthesis'!K24)),\"X\",\"\")","v":""},{"$f":"IF(ISNUMBER(SEARCH(\"Field research\",'Data extraction-synthesis'!K24)),\"X\",\"\")","v":""},{"$f":"IF(ISNUMBER(SEARCH(\"Policies\",'Data extraction-synthesis'!K24)),\"X\",\"\")","v":""},{"$f":"IF(ISNUMBER(SEARCH(\"Websites of developers\",'Data extraction-synthesis'!K24)),\"X\",\"\")","v":""},{"$f":"IF(ISNUMBER(SEARCH(\"Data available\",'Data extraction-synthesis'!K24)),\"X\",\"\")","v":""},{"$f":"IF(ISNUMBER(SEARCH(\"No scoping phase reported\",'Data extraction-synthesis'!K24)),\"X\",\"\")","v":""},{"$f":"IF(ISNUMBER(SEARCH(\"N/A\",'Data extraction-synthesis'!K24)),\"X\",\"\")","v":""},"NO",{"$nulls":4},"Expert opinion"]
["WHO","Development of a Target Product Profile (TPP) and framework for evaluation for a test predicting progression from tubercolosis infection to active disease",{"$f":"IF(ISNUMBER(SEARCH(\"Literature\",'Data extraction-synthesis'!K25)),\"X\",\"\")","v":""},{"$f":"IF(ISNUMBER(SEARCH(\"Interviews with experts\",'Data extraction-synthesis'!K25)),\"X\",\"\")","v":""},{"$f":"IF(ISNUMBER(SEARCH(\"Survey with experts/Expert opinion\",'Data extraction-synthesis'!K25)),\"X\",\"\")","v":""},{"$f":"IF(ISNUMBER(SEARCH(\"Ethnographic interviews\",'Data extraction-synthesis'!K25)),\"X\",\"\")","v":""},{"$f":"IF(ISNUMBER(SEARCH(\"Reports\",'Data extraction-synthesis'!K25)),\"X\",\"\")","v":""},{"$f":"IF(ISNUMBER(SEARCH(\"Questionnaire provided to expert\",'Data extraction-synthesis'!K25)),\"X\",\"\")","v":""},{"$f":"IF(ISNUMBER(SEARCH(\"Field research\",'Data extraction-synthesis'!K25)),\"X\",\"\")","v":""},{"$f":"IF(ISNUMBER(SEARCH(\"Policies\",'Data extraction-synthesis'!K25)),\"X\",\"\")","v":""},{"$f":"IF(ISNUMBER(SEARCH(\"Websites of developers\",'Data extraction-synthesis'!K25)),\"X\",\"\")","v":""},{"$f":"IF(ISNUMBER(SEARCH(\"Data available\",'Data extraction-synthesis'!K25)),\"X\",\"\")","v":""},{"$f":"IF(ISNUMBER(SEARCH(\"No scoping phase reported\",'Data extraction-synthesis'!K25)),\"X\",\"\")","v":"X"},{"$f":"IF(ISNUMBER(SEARCH(\"N/A\",'Data extraction-synthesis'!K25)),\"X\",\"\")","v":""},"N/A"]
["WHO","Specifications for a rapid diagnostic test for meningitis African meningitis belt/ Target product profile for the development of a new generation of rapid test for the diagnosis of bacterial meningitis",{"$f":"IF(ISNUMBER(SEARCH(\"Literature\",'Data extraction-synthesis'!K26)),\"X\",\"\")","v":""},{"$f":"IF(ISNUMBER(SEARCH(\"Interviews with experts\",'Data extraction-synthesis'!K26)),\"X\",\"\")","v":""},{"$f":"IF(ISNUMBER(SEARCH(\"Survey with experts/Expert opinion\",'Data extraction-synthesis'!K26)),\"X\",\"\")","v":""},{"$f":"IF(ISNUMBER(SEARCH(\"Ethnographic interviews\",'Data extraction-synthesis'!K26)),\"X\",\"\")","v":""},{"$f":"IF(ISNUMBER(SEARCH(\"Reports\",'Data extraction-synthesis'!K26)),\"X\",\"\")","v":""},{"$f":"IF(ISNUMBER(SEARCH(\"Questionnaire provided to expert\",'Data extraction-synthesis'!K26)),\"X\",\"\")","v":""},{"$f":"IF(ISNUMBER(SEARCH(\"Field research\",'Data extraction-synthesis'!K26)),\"X\",\"\")","v":""},{"$f":"IF(ISNUMBER(SEARCH(\"Policies\",'Data extraction-synthesis'!K26)),\"X\",\"\")","v":""},{"$f":"IF(ISNUMBER(SEARCH(\"Websites of developers\",'Data extraction-synthesis'!K26)),\"X\",\"\")","v":""},{"$f":"IF(ISNUMBER(SEARCH(\"Data available\",'Data extraction-synthesis'!K26)),\"X\",\"\")","v":""},{"$f":"IF(ISNUMBER(SEARCH(\"No scoping phase reported\",'Data extraction-synthesis'!K26)),\"X\",\"\")","v":"X"},{"$f":"IF(ISNUMBER(SEARCH(\"N/A\",'Data extraction-synthesis'!K26)),\"X\",\"\")","v":""},"N/A"]
["WHO","Target Product Profile for Zaire ebolavirus rapid,simple test to be used in the control of the Ebola outbreak in West Africa",{"$f":"IF(ISNUMBER(SEARCH(\"Literature\",'Data extraction-synthesis'!K27)),\"X\",\"\")","v":""},{"$f":"IF(ISNUMBER(SEARCH(\"Interviews with experts\",'Data extraction-synthesis'!K27)),\"X\",\"\")","v":""},{"$f":"IF(ISNUMBER(SEARCH(\"Survey with experts/Expert opinion\",'Data extraction-synthesis'!K27)),\"X\",\"\")","v":""},{"$f":"IF(ISNUMBER(SEARCH(\"Ethnographic interviews\",'Data extraction-synthesis'!K27)),\"X\",\"\")","v":""},{"$f":"IF(ISNUMBER(SEARCH(\"Reports\",'Data extraction-synthesis'!K27)),\"X\",\"\")","v":""},{"$f":"IF(ISNUMBER(SEARCH(\"Questionnaire provided to expert\",'Data extraction-synthesis'!K27)),\"X\",\"\")","v":""},{"$f":"IF(ISNUMBER(SEARCH(\"Field research\",'Data extraction-synthesis'!K27)),\"X\",\"\")","v":""},{"$f":"IF(ISNUMBER(SEARCH(\"Policies\",'Data extraction-synthesis'!K27)),\"X\",\"\")","v":""},{"$f":"IF(ISNUMBER(SEARCH(\"Websites of developers\",'Data extraction-synthesis'!K27)),\"X\",\"\")","v":""},{"$f":"IF(ISNUMBER(SEARCH(\"Data available\",'Data extraction-synthesis'!K27)),\"X\",\"\")","v":""},{"$f":"IF(ISNUMBER(SEARCH(\"No scoping phase reported\",'Data extraction-synthesis'!K27)),\"X\",\"\")","v":"X"},{"$f":"IF(ISNUMBER(SEARCH(\"N/A\",'Data extraction-synthesis'!K27)),\"X\",\"\")","v":""},"N/A"]
["WHO","Report of WHO-FIND meeting on diagnostics for Buruli ulcer",{"$f":"IF(ISNUMBER(SEARCH(\"Literature\",'Data extraction-synthesis'!K28)),\"X\",\"\")","v":""},{"$f":"IF(ISNUMBER(SEARCH(\"Interviews with experts\",'Data extraction-synthesis'!K28)),\"X\",\"\")","v":""},{"$f":"IF(ISNUMBER(SEARCH(\"Survey with experts/Expert opinion\",'Data extraction-synthesis'!K28)),\"X\",\"\")","v":"X"},{"$f":"IF(ISNUMBER(SEARCH(\"Ethnographic interviews\",'Data extraction-synthesis'!K28)),\"X\",\"\")","v":""},{"$f":"IF(ISNUMBER(SEARCH(\"Reports\",'Data extraction-synthesis'!K28)),\"X\",\"\")","v":""},{"$f":"IF(ISNUMBER(SEARCH(\"Questionnaire provided to expert\",'Data extraction-synthesis'!K28)),\"X\",\"\")","v":""},{"$f":"IF(ISNUMBER(SEARCH(\"Field research\",'Data extraction-synthesis'!K28)),\"X\",\"\")","v":""},{"$f":"IF(ISNUMBER(SEARCH(\"Policies\",'Data extraction-synthesis'!K28)),\"X\",\"\")","v":""},{"$f":"IF(ISNUMBER(SEARCH(\"Websites of developers\",'Data extraction-synthesis'!K28)),\"X\",\"\")","v":""},{"$f":"IF(ISNUMBER(SEARCH(\"Data available\",'Data extraction-synthesis'!K28)),\"X\",\"\")","v":""},{"$f":"IF(ISNUMBER(SEARCH(\"No scoping phase reported\",'Data extraction-synthesis'!K28)),\"X\",\"\")","v":""},{"$f":"IF(ISNUMBER(SEARCH(\"N/A\",'Data extraction-synthesis'!K28)),\"X\",\"\")","v":""},"NO",{"$nulls":4},"Expert opinion"]
["WHO","Taenia solium taeniasis/cysticercosis diagnostic tools. Report of a stakeholder meeting",{"$f":"IF(ISNUMBER(SEARCH(\"Literature\",'Data extraction-synthesis'!K29)),\"X\",\"\")","v":""},{"$f":"IF(ISNUMBER(SEARCH(\"Interviews with experts\",'Data extraction-synthesis'!K29)),\"X\",\"\")","v":""},{"$f":"IF(ISNUMBER(SEARCH(\"Survey with experts/Expert opinion\",'Data extraction-synthesis'!K29)),\"X\",\"\")","v":"X"},{"$f":"IF(ISNUMBER(SEARCH(\"Ethnographic interviews\",'Data extraction-synthesis'!K29)),\"X\",\"\")","v":""},{"$f":"IF(ISNUMBER(SEARCH(\"Reports\",'Data extraction-synthesis'!K29)),\"X\",\"\")","v":""},{"$f":"IF(ISNUMBER(SEARCH(\"Questionnaire provided to expert\",'Data extraction-synthesis'!K29)),\"X\",\"\")","v":""},{"$f":"IF(ISNUMBER(SEARCH(\"Field research\",'Data extraction-synthesis'!K29)),\"X\",\"\")","v":""},{"$f":"IF(ISNUMBER(SEARCH(\"Policies\",'Data extraction-synthesis'!K29)),\"X\",\"\")","v":""},{"$f":"IF(ISNUMBER(SEARCH(\"Websites of developers\",'Data extraction-synthesis'!K29)),\"X\",\"\")","v":""},{"$f":"IF(ISNUMBER(SEARCH(\"Data available\",'Data extraction-synthesis'!K29)),\"X\",\"\")","v":""},{"$f":"IF(ISNUMBER(SEARCH(\"No scoping phase reported\",'Data extraction-synthesis'!K29)),\"X\",\"\")","v":""},{"$f":"IF(ISNUMBER(SEARCH(\"N/A\",'Data extraction-synthesis'!K29)),\"X\",\"\")","v":""},"NO",{"$nulls":4},"Expert opinion"]
["Utzinger, J. B., S. L.: van Lieshout, L.: van Dam, G. J.: Knopp, S","New diagnostic tools in schistosomiasis",{"$f":"IF(ISNUMBER(SEARCH(\"Literature\",'Data extraction-synthesis'!K30)),\"X\",\"\")","v":""},{"$f":"IF(ISNUMBER(SEARCH(\"Interviews with experts\",'Data extraction-synthesis'!K30)),\"X\",\"\")","v":""},{"$f":"IF(ISNUMBER(SEARCH(\"Survey with experts/Expert opinion\",'Data extraction-synthesis'!K30)),\"X\",\"\")","v":""},{"$f":"IF(ISNUMBER(SEARCH(\"Ethnographic interviews\",'Data extraction-synthesis'!K30)),\"X\",\"\")","v":""},{"$f":"IF(ISNUMBER(SEARCH(\"Reports\",'Data extraction-synthesis'!K30)),\"X\",\"\")","v":""},{"$f":"IF(ISNUMBER(SEARCH(\"Questionnaire provided to expert\",'Data extraction-synthesis'!K30)),\"X\",\"\")","v":""},{"$f":"IF(ISNUMBER(SEARCH(\"Field research\",'Data extraction-synthesis'!K30)),\"X\",\"\")","v":""},{"$f":"IF(ISNUMBER(SEARCH(\"Policies\",'Data extraction-synthesis'!K30)),\"X\",\"\")","v":""},{"$f":"IF(ISNUMBER(SEARCH(\"Websites of developers\",'Data extraction-synthesis'!K30)),\"X\",\"\")","v":""},{"$f":"IF(ISNUMBER(SEARCH(\"Data available\",'Data extraction-synthesis'!K30)),\"X\",\"\")","v":""},{"$f":"IF(ISNUMBER(SEARCH(\"No scoping phase reported\",'Data extraction-synthesis'!K30)),\"X\",\"\")","v":"X"},{"$f":"IF(ISNUMBER(SEARCH(\"N/A\",'Data extraction-synthesis'!K30)),\"X\",\"\")","v":""},"N/A"]
["UNICEF","Zika Virus Diagnostics: Target Product Profiles & Supply Update",{"$f":"IF(ISNUMBER(SEARCH(\"Literature\",'Data extraction-synthesis'!K31)),\"X\",\"\")","v":""},{"$f":"IF(ISNUMBER(SEARCH(\"Interviews with experts\",'Data extraction-synthesis'!K31)),\"X\",\"\")","v":""},{"$f":"IF(ISNUMBER(SEARCH(\"Survey with experts/Expert opinion\",'Data extraction-synthesis'!K31)),\"X\",\"\")","v":"X"},{"$f":"IF(ISNUMBER(SEARCH(\"Ethnographic interviews\",'Data extraction-synthesis'!K31)),\"X\",\"\")","v":""},{"$f":"IF(ISNUMBER(SEARCH(\"Reports\",'Data extraction-synthesis'!K31)),\"X\",\"\")","v":""},{"$f":"IF(ISNUMBER(SEARCH(\"Questionnaire provided to expert\",'Data extraction-synthesis'!K31)),\"X\",\"\")","v":""},{"$f":"IF(ISNUMBER(SEARCH(\"Field research\",'Data extraction-synthesis'!K31)),\"X\",\"\")","v":""},{"$f":"IF(ISNUMBER(SEARCH(\"Policies\",'Data extraction-synthesis'!K31)),\"X\",\"\")","v":""},{"$f":"IF(ISNUMBER(SEARCH(\"Websites of developers\",'Data extraction-synthesis'!K31)),\"X\",\"\")","v":""},{"$f":"IF(ISNUMBER(SEARCH(\"Data available\",'Data extraction-synthesis'!K31)),\"X\",\"\")","v":""},{"$f":"IF(ISNUMBER(SEARCH(\"No scoping phase reported\",'Data extraction-synthesis'!K31)),\"X\",\"\")","v":""},{"$f":"IF(ISNUMBER(SEARCH(\"N/A\",'Data extraction-synthesis'!K31)),\"X\",\"\")","v":""},"NO",{"$nulls":4},"Expert opinion"]
["UNICEF","Pneumonia Acute Respiratory Infection Diagnostic Aid-Target Product Profile Introduction",{"$f":"IF(ISNUMBER(SEARCH(\"Literature\",'Data extraction-synthesis'!K32)),\"X\",\"\")","v":"X"},{"$f":"IF(ISNUMBER(SEARCH(\"Interviews with experts\",'Data extraction-synthesis'!K32)),\"X\",\"\")","v":""},{"$f":"IF(ISNUMBER(SEARCH(\"Survey with experts/Expert opinion\",'Data extraction-synthesis'!K32)),\"X\",\"\")","v":"X"},{"$f":"IF(ISNUMBER(SEARCH(\"Ethnographic interviews\",'Data extraction-synthesis'!K32)),\"X\",\"\")","v":""},{"$f":"IF(ISNUMBER(SEARCH(\"Reports\",'Data extraction-synthesis'!K32)),\"X\",\"\")","v":""},{"$f":"IF(ISNUMBER(SEARCH(\"Questionnaire provided to expert\",'Data extraction-synthesis'!K32)),\"X\",\"\")","v":""},{"$f":"IF(ISNUMBER(SEARCH(\"Field research\",'Data extraction-synthesis'!K32)),\"X\",\"\")","v":""},{"$f":"IF(ISNUMBER(SEARCH(\"Policies\",'Data extraction-synthesis'!K32)),\"X\",\"\")","v":""},{"$f":"IF(ISNUMBER(SEARCH(\"Websites of developers\",'Data extraction-synthesis'!K32)),\"X\",\"\")","v":""},{"$f":"IF(ISNUMBER(SEARCH(\"Data available\",'Data extraction-synthesis'!K32)),\"X\",\"\")","v":""},{"$f":"IF(ISNUMBER(SEARCH(\"No scoping phase reported\",'Data extraction-synthesis'!K32)),\"X\",\"\")","v":""},{"$f":"IF(ISNUMBER(SEARCH(\"N/A\",'Data extraction-synthesis'!K32)),\"X\",\"\")","v":""},"YES",{"$nulls":7},"They mentioned only literature reviews"]
["Pal S, Jasper L.E., Lawrence K.L, Walter M","Assessing the Dengue Diagnosis Capability Gap in the Military Health System",{"$f":"IF(ISNUMBER(SEARCH(\"Literature\",'Data extraction-synthesis'!K33)),\"X\",\"\")","v":""},null,{"$f":"IF(ISNUMBER(SEARCH(\"Survey with experts/Expert opinion\",'Data extraction-synthesis'!K33)),\"X\",\"\")","v":""},{"$f":"IF(ISNUMBER(SEARCH(\"Ethnographic interviews\",'Data extraction-synthesis'!K33)),\"X\",\"\")","v":""},{"$f":"IF(ISNUMBER(SEARCH(\"Reports\",'Data extraction-synthesis'!K33)),\"X\",\"\")","v":""},{"$f":"IF(ISNUMBER(SEARCH(\"Questionnaire provided to expert\",'Data extraction-synthesis'!K33)),\"X\",\"\")","v":"X"},{"$f":"IF(ISNUMBER(SEARCH(\"Field research\",'Data extraction-synthesis'!K33)),\"X\",\"\")","v":""},{"$f":"IF(ISNUMBER(SEARCH(\"Policies\",'Data extraction-synthesis'!K33)),\"X\",\"\")","v":""},{"$f":"IF(ISNUMBER(SEARCH(\"Websites of developers\",'Data extraction-synthesis'!K33)),\"X\",\"\")","v":""},{"$f":"IF(ISNUMBER(SEARCH(\"Data available\",'Data extraction-synthesis'!K33)),\"X\",\"\")","v":""},{"$f":"IF(ISNUMBER(SEARCH(\"No scoping phase reported\",'Data extraction-synthesis'!K33)),\"X\",\"\")","v":""},{"$f":"IF(ISNUMBER(SEARCH(\"N/A\",'Data extraction-synthesis'!K33)),\"X\",\"\")","v":""},"NO",{"$nulls":4},"Expert opinion"]
["PATH","Target Product Profile: Schistosomiasis Surveillance Diagnostic Lateral Flow Test CAA antigen",{"$f":"IF(ISNUMBER(SEARCH(\"Literature\",'Data extraction-synthesis'!K34)),\"X\",\"\")","v":""},{"$f":"IF(ISNUMBER(SEARCH(\"Interviews with experts\",'Data extraction-synthesis'!K34)),\"X\",\"\")","v":""},{"$f":"IF(ISNUMBER(SEARCH(\"Survey with experts/Expert opinion\",'Data extraction-synthesis'!K34)),\"X\",\"\")","v":""},{"$f":"IF(ISNUMBER(SEARCH(\"Ethnographic interviews\",'Data extraction-synthesis'!K34)),\"X\",\"\")","v":""},{"$f":"IF(ISNUMBER(SEARCH(\"Reports\",'Data extraction-synthesis'!K34)),\"X\",\"\")","v":""},{"$f":"IF(ISNUMBER(SEARCH(\"Questionnaire provided to expert\",'Data extraction-synthesis'!K34)),\"X\",\"\")","v":""},{"$f":"IF(ISNUMBER(SEARCH(\"Field research\",'Data extraction-synthesis'!K34)),\"X\",\"\")","v":""},{"$f":"IF(ISNUMBER(SEARCH(\"Policies\",'Data extraction-synthesis'!K34)),\"X\",\"\")","v":""},{"$f":"IF(ISNUMBER(SEARCH(\"Websites of developers\",'Data extraction-synthesis'!K34)),\"X\",\"\")","v":""},{"$f":"IF(ISNUMBER(SEARCH(\"Data available\",'Data extraction-synthesis'!K34)),\"X\",\"\")","v":""},{"$f":"IF(ISNUMBER(SEARCH(\"No scoping phase reported\",'Data extraction-synthesis'!K34)),\"X\",\"\")","v":"X"},{"$f":"IF(ISNUMBER(SEARCH(\"N/A\",'Data extraction-synthesis'!K34)),\"X\",\"\")","v":""},"N/A"]
["PATH","Target Product Profile: Trachoma Surveillance Diagnostic-Post-Elimination Surveillance Antibody Lateral Flow Test",{"$f":"IF(ISNUMBER(SEARCH(\"Literature\",'Data extraction-synthesis'!K35)),\"X\",\"\")","v":""},{"$f":"IF(ISNUMBER(SEARCH(\"Interviews with experts\",'Data extraction-synthesis'!K35)),\"X\",\"\")","v":""},{"$f":"IF(ISNUMBER(SEARCH(\"Survey with experts/Expert opinion\",'Data extraction-synthesis'!K35)),\"X\",\"\")","v":""},{"$f":"IF(ISNUMBER(SEARCH(\"Ethnographic interviews\",'Data extraction-synthesis'!K35)),\"X\",\"\")","v":""},{"$f":"IF(ISNUMBER(SEARCH(\"Reports\",'Data extraction-synthesis'!K35)),\"X\",\"\")","v":""},{"$f":"IF(ISNUMBER(SEARCH(\"Questionnaire provided to expert\",'Data extraction-synthesis'!K35)),\"X\",\"\")","v":""},{"$f":"IF(ISNUMBER(SEARCH(\"Field research\",'Data extraction-synthesis'!K35)),\"X\",\"\")","v":""},{"$f":"IF(ISNUMBER(SEARCH(\"Policies\",'Data extraction-synthesis'!K35)),\"X\",\"\")","v":""},{"$f":"IF(ISNUMBER(SEARCH(\"Websites of developers\",'Data extraction-synthesis'!K35)),\"X\",\"\")","v":""},{"$f":"IF(ISNUMBER(SEARCH(\"Data available\",'Data extraction-synthesis'!K35)),\"X\",\"\")","v":""},{"$f":"IF(ISNUMBER(SEARCH(\"No scoping phase reported\",'Data extraction-synthesis'!K35)),\"X\",\"\")","v":"X"},{"$f":"IF(ISNUMBER(SEARCH(\"N/A\",'Data extraction-synthesis'!K35)),\"X\",\"\")","v":""},"N/A"]
["International Diagnostics Centre (IDC)","Target Product Profile (TPP) - Point-of-Care HIV Viral Load Test",{"$f":"IF(ISNUMBER(SEARCH(\"Literature\",'Data extraction-synthesis'!K36)),\"X\",\"\")","v":""},{"$f":"IF(ISNUMBER(SEARCH(\"Interviews with experts\",'Data extraction-synthesis'!K36)),\"X\",\"\")","v":""},{"$f":"IF(ISNUMBER(SEARCH(\"Survey with experts/Expert opinion\",'Data extraction-synthesis'!K36)),\"X\",\"\")","v":""},{"$f":"IF(ISNUMBER(SEARCH(\"Ethnographic interviews\",'Data extraction-synthesis'!K36)),\"X\",\"\")","v":""},{"$f":"IF(ISNUMBER(SEARCH(\"Reports\",'Data extraction-synthesis'!K36)),\"X\",\"\")","v":""},{"$f":"IF(ISNUMBER(SEARCH(\"Questionnaire provided to expert\",'Data extraction-synthesis'!K36)),\"X\",\"\")","v":""},{"$f":"IF(ISNUMBER(SEARCH(\"Field research\",'Data extraction-synthesis'!K36)),\"X\",\"\")","v":""},{"$f":"IF(ISNUMBER(SEARCH(\"Policies\",'Data extraction-synthesis'!K36)),\"X\",\"\")","v":""},{"$f":"IF(ISNUMBER(SEARCH(\"Websites of developers\",'Data extraction-synthesis'!K36)),\"X\",\"\")","v":""},{"$f":"IF(ISNUMBER(SEARCH(\"Data available\",'Data extraction-synthesis'!K36)),\"X\",\"\")","v":""},{"$f":"IF(ISNUMBER(SEARCH(\"No scoping phase reported\",'Data extraction-synthesis'!K36)),\"X\",\"\")","v":"X"},{"$f":"IF(ISNUMBER(SEARCH(\"N/A\",'Data extraction-synthesis'!K36)),\"X\",\"\")","v":""},"N/A"]
["International Diagnostics Centre (IDC)","Target Product Profile (TPP)- Point of care CD4 test",{"$f":"IF(ISNUMBER(SEARCH(\"Literature\",'Data extraction-synthesis'!K37)),\"X\",\"\")","v":""},{"$f":"IF(ISNUMBER(SEARCH(\"Interviews with experts\",'Data extraction-synthesis'!K37)),\"X\",\"\")","v":""},{"$f":"IF(ISNUMBER(SEARCH(\"Survey with experts/Expert opinion\",'Data extraction-synthesis'!K37)),\"X\",\"\")","v":""},{"$f":"IF(ISNUMBER(SEARCH(\"Ethnographic interviews\",'Data extraction-synthesis'!K37)),\"X\",\"\")","v":""},{"$f":"IF(ISNUMBER(SEARCH(\"Reports\",'Data extraction-synthesis'!K37)),\"X\",\"\")","v":""},{"$f":"IF(ISNUMBER(SEARCH(\"Questionnaire provided to expert\",'Data extraction-synthesis'!K37)),\"X\",\"\")","v":""},{"$f":"IF(ISNUMBER(SEARCH(\"Field research\",'Data extraction-synthesis'!K37)),\"X\",\"\")","v":""},{"$f":"IF(ISNUMBER(SEARCH(\"Policies\",'Data extraction-synthesis'!K37)),\"X\",\"\")","v":""},{"$f":"IF(ISNUMBER(SEARCH(\"Websites of developers\",'Data extraction-synthesis'!K37)),\"X\",\"\")","v":""},{"$f":"IF(ISNUMBER(SEARCH(\"Data available\",'Data extraction-synthesis'!K37)),\"X\",\"\")","v":""},{"$f":"IF(ISNUMBER(SEARCH(\"No scoping phase reported\",'Data extraction-synthesis'!K37)),\"X\",\"\")","v":"X"},{"$f":"IF(ISNUMBER(SEARCH(\"N/A\",'Data extraction-synthesis'!K37)),\"X\",\"\")","v":""},"N/A"]
["International Diagnostics Centre (IDC)","Target Product Profile (TPP): Point of care EID test",{"$f":"IF(ISNUMBER(SEARCH(\"Literature\",'Data extraction-synthesis'!K38)),\"X\",\"\")","v":""},{"$f":"IF(ISNUMBER(SEARCH(\"Interviews with experts\",'Data extraction-synthesis'!K38)),\"X\",\"\")","v":""},{"$f":"IF(ISNUMBER(SEARCH(\"Survey with experts/Expert opinion\",'Data extraction-synthesis'!K38)),\"X\",\"\")","v":""},{"$f":"IF(ISNUMBER(SEARCH(\"Ethnographic interviews\",'Data extraction-synthesis'!K38)),\"X\",\"\")","v":""},{"$f":"IF(ISNUMBER(SEARCH(\"Reports\",'Data extraction-synthesis'!K38)),\"X\",\"\")","v":""},{"$f":"IF(ISNUMBER(SEARCH(\"Questionnaire provided to expert\",'Data extraction-synthesis'!K38)),\"X\",\"\")","v":""},{"$f":"IF(ISNUMBER(SEARCH(\"Field research\",'Data extraction-synthesis'!K38)),\"X\",\"\")","v":""},{"$f":"IF(ISNUMBER(SEARCH(\"Policies\",'Data extraction-synthesis'!K38)),\"X\",\"\")","v":""},{"$f":"IF(ISNUMBER(SEARCH(\"Websites of developers\",'Data extraction-synthesis'!K38)),\"X\",\"\")","v":""},{"$f":"IF(ISNUMBER(SEARCH(\"Data available\",'Data extraction-synthesis'!K38)),\"X\",\"\")","v":""},{"$f":"IF(ISNUMBER(SEARCH(\"No scoping phase reported\",'Data extraction-synthesis'!K38)),\"X\",\"\")","v":"X"},{"$f":"IF(ISNUMBER(SEARCH(\"N/A\",'Data extraction-synthesis'!K38)),\"X\",\"\")","v":""},"N/A"]
["Internationa Diagnostics Centre (IDC)","Target Product Profile (TPP): Combined HIV/Syphilis Test",{"$f":"IF(ISNUMBER(SEARCH(\"Literature\",'Data extraction-synthesis'!K39)),\"X\",\"\")","v":""},{"$f":"IF(ISNUMBER(SEARCH(\"Interviews with experts\",'Data extraction-synthesis'!K39)),\"X\",\"\")","v":""},{"$f":"IF(ISNUMBER(SEARCH(\"Survey with experts/Expert opinion\",'Data extraction-synthesis'!K39)),\"X\",\"\")","v":""},{"$f":"IF(ISNUMBER(SEARCH(\"Ethnographic interviews\",'Data extraction-synthesis'!K39)),\"X\",\"\")","v":""},{"$f":"IF(ISNUMBER(SEARCH(\"Reports\",'Data extraction-synthesis'!K39)),\"X\",\"\")","v":""},{"$f":"IF(ISNUMBER(SEARCH(\"Questionnaire provided to expert\",'Data extraction-synthesis'!K39)),\"X\",\"\")","v":""},{"$f":"IF(ISNUMBER(SEARCH(\"Field research\",'Data extraction-synthesis'!K39)),\"X\",\"\")","v":""},{"$f":"IF(ISNUMBER(SEARCH(\"Policies\",'Data extraction-synthesis'!K39)),\"X\",\"\")","v":""},{"$f":"IF(ISNUMBER(SEARCH(\"Websites of developers\",'Data extraction-synthesis'!K39)),\"X\",\"\")","v":""},{"$f":"IF(ISNUMBER(SEARCH(\"Data available\",'Data extraction-synthesis'!K39)),\"X\",\"\")","v":""},{"$f":"IF(ISNUMBER(SEARCH(\"No scoping phase reported\",'Data extraction-synthesis'!K39)),\"X\",\"\")","v":"X"},{"$f":"IF(ISNUMBER(SEARCH(\"N/A\",'Data extraction-synthesis'!K39)),\"X\",\"\")","v":""},"N/A"]
["Ebels, K. B. C., C.: Crudder, C. H.: McGray, S.: Magnuson, K.: Tietje, K.: Labarre, P","Incorporating user needs into product development for improved infection detection for malaria elimination programs",{"$f":"IF(ISNUMBER(SEARCH(\"Literature\",'Data extraction-synthesis'!K40)),\"X\",\"\")","v":""},{"$f":"IF(ISNUMBER(SEARCH(\"Interviews with experts\",'Data extraction-synthesis'!K40)),\"X\",\"\")","v":""},{"$f":"IF(ISNUMBER(SEARCH(\"Survey with experts/Expert opinion\",'Data extraction-synthesis'!K40)),\"X\",\"\")","v":""},{"$f":"IF(ISNUMBER(SEARCH(\"Ethnographic interviews\",'Data extraction-synthesis'!K40)),\"X\",\"\")","v":"X"},{"$f":"IF(ISNUMBER(SEARCH(\"Reports\",'Data extraction-synthesis'!K40)),\"X\",\"\")","v":""},{"$f":"IF(ISNUMBER(SEARCH(\"Questionnaire provided to expert\",'Data extraction-synthesis'!K40)),\"X\",\"\")","v":""},{"$f":"IF(ISNUMBER(SEARCH(\"Field research\",'Data extraction-synthesis'!K40)),\"X\",\"\")","v":"X"},{"$f":"IF(ISNUMBER(SEARCH(\"Policies\",'Data extraction-synthesis'!K40)),\"X\",\"\")","v":""},{"$f":"IF(ISNUMBER(SEARCH(\"Websites of developers\",'Data extraction-synthesis'!K40)),\"X\",\"\")","v":""},{"$f":"IF(ISNUMBER(SEARCH(\"Data available\",'Data extraction-synthesis'!K40)),\"X\",\"\")","v":""},{"$f":"IF(ISNUMBER(SEARCH(\"No scoping phase reported\",'Data extraction-synthesis'!K40)),\"X\",\"\")","v":""},{"$f":"IF(ISNUMBER(SEARCH(\"N/A\",'Data extraction-synthesis'!K40)),\"X\",\"\")","v":""},"YES"]
["FIND","Target Product Profile: Screening test for human African trypanosomiasis (HAT)",{"$f":"IF(ISNUMBER(SEARCH(\"Literature\",'Data extraction-synthesis'!K41)),\"X\",\"\")","v":""},{"$f":"IF(ISNUMBER(SEARCH(\"Interviews with experts\",'Data extraction-synthesis'!K41)),\"X\",\"\")","v":""},{"$f":"IF(ISNUMBER(SEARCH(\"Survey with experts/Expert opinion\",'Data extraction-synthesis'!K41)),\"X\",\"\")","v":""},{"$f":"IF(ISNUMBER(SEARCH(\"Ethnographic interviews\",'Data extraction-synthesis'!K41)),\"X\",\"\")","v":""},{"$f":"IF(ISNUMBER(SEARCH(\"Reports\",'Data extraction-synthesis'!K41)),\"X\",\"\")","v":""},{"$f":"IF(ISNUMBER(SEARCH(\"Questionnaire provided to expert\",'Data extraction-synthesis'!K41)),\"X\",\"\")","v":""},{"$f":"IF(ISNUMBER(SEARCH(\"Field research\",'Data extraction-synthesis'!K41)),\"X\",\"\")","v":""},{"$f":"IF(ISNUMBER(SEARCH(\"Policies\",'Data extraction-synthesis'!K41)),\"X\",\"\")","v":""},{"$f":"IF(ISNUMBER(SEARCH(\"Websites of developers\",'Data extraction-synthesis'!K41)),\"X\",\"\")","v":""},{"$f":"IF(ISNUMBER(SEARCH(\"Data available\",'Data extraction-synthesis'!K41)),\"X\",\"\")","v":""},{"$f":"IF(ISNUMBER(SEARCH(\"No scoping phase reported\",'Data extraction-synthesis'!K41)),\"X\",\"\")","v":"X"},{"$f":"IF(ISNUMBER(SEARCH(\"N/A\",'Data extraction-synthesis'!K41)),\"X\",\"\")","v":""},"N/A"]
["PATH","Target Product Profile: Trachoma surveillance diagnostic-antigen lateral flow test",{"$f":"IF(ISNUMBER(SEARCH(\"Literature\",'Data extraction-synthesis'!K42)),\"X\",\"\")","v":""},{"$f":"IF(ISNUMBER(SEARCH(\"Interviews with experts\",'Data extraction-synthesis'!K42)),\"X\",\"\")","v":""},{"$f":"IF(ISNUMBER(SEARCH(\"Survey with experts/Expert opinion\",'Data extraction-synthesis'!K42)),\"X\",\"\")","v":""},{"$f":"IF(ISNUMBER(SEARCH(\"Ethnographic interviews\",'Data extraction-synthesis'!K42)),\"X\",\"\")","v":""},{"$f":"IF(ISNUMBER(SEARCH(\"Reports\",'Data extraction-synthesis'!K42)),\"X\",\"\")","v":""},{"$f":"IF(ISNUMBER(SEARCH(\"Questionnaire provided to expert\",'Data extraction-synthesis'!K42)),\"X\",\"\")","v":""},{"$f":"IF(ISNUMBER(SEARCH(\"Field research\",'Data extraction-synthesis'!K42)),\"X\",\"\")","v":""},{"$f":"IF(ISNUMBER(SEARCH(\"Policies\",'Data extraction-synthesis'!K42)),\"X\",\"\")","v":""},{"$f":"IF(ISNUMBER(SEARCH(\"Websites of developers\",'Data extraction-synthesis'!K42)),\"X\",\"\")","v":""},{"$f":"IF(ISNUMBER(SEARCH(\"Data available\",'Data extraction-synthesis'!K42)),\"X\",\"\")","v":""},{"$f":"IF(ISNUMBER(SEARCH(\"No scoping phase reported\",'Data extraction-synthesis'!K42)),\"X\",\"\")","v":"X"},{"$f":"IF(ISNUMBER(SEARCH(\"N/A\",'Data extraction-synthesis'!K42)),\"X\",\"\")","v":""},"N/A",{"$nulls":4},{"$f":"3/22","v":{"v":0.13636363636363635,"d":"14%"}}]
["Peck, R. B. W., J. D.: Boettcher, M. G.: Downing","Defining product requirements for field deployable yellow fever tests",{"$f":"IF(ISNUMBER(SEARCH(\"Literature\",'Data extraction-synthesis'!K43)),\"X\",\"\")","v":""},{"$f":"IF(ISNUMBER(SEARCH(\"Interviews with experts\",'Data extraction-synthesis'!K43)),\"X\",\"\")","v":"X"},{"$f":"IF(ISNUMBER(SEARCH(\"Survey with experts/Expert opinion\",'Data extraction-synthesis'!K43)),\"X\",\"\")","v":""},{"$f":"IF(ISNUMBER(SEARCH(\"Ethnographic interviews\",'Data extraction-synthesis'!K43)),\"X\",\"\")","v":""},{"$f":"IF(ISNUMBER(SEARCH(\"Reports\",'Data extraction-synthesis'!K43)),\"X\",\"\")","v":""},{"$f":"IF(ISNUMBER(SEARCH(\"Questionnaire provided to expert\",'Data extraction-synthesis'!K43)),\"X\",\"\")","v":""},{"$f":"IF(ISNUMBER(SEARCH(\"Field research\",'Data extraction-synthesis'!K43)),\"X\",\"\")","v":""},{"$f":"IF(ISNUMBER(SEARCH(\"Policies\",'Data extraction-synthesis'!K43)),\"X\",\"\")","v":""},{"$f":"IF(ISNUMBER(SEARCH(\"Websites of developers\",'Data extraction-synthesis'!K43)),\"X\",\"\")","v":""},{"$f":"IF(ISNUMBER(SEARCH(\"Data available\",'Data extraction-synthesis'!K43)),\"X\",\"\")","v":""},{"$f":"IF(ISNUMBER(SEARCH(\"No scoping phase reported\",'Data extraction-synthesis'!K43)),\"X\",\"\")","v":""},{"$f":"IF(ISNUMBER(SEARCH(\"N/A\",'Data extraction-synthesis'!K43)),\"X\",\"\")","v":""},"NO",{"$nulls":4},"Interviews"]
["PATH","Target Product Profile: Schistosomiasis Surveillance Diagnostic - schistosoma genus-specific antibody lateral flow test post-elimination surveillance",{"$f":"IF(ISNUMBER(SEARCH(\"Literature\",'Data extraction-synthesis'!K44)),\"X\",\"\")","v":""},{"$f":"IF(ISNUMBER(SEARCH(\"Interviews with experts\",'Data extraction-synthesis'!K44)),\"X\",\"\")","v":""},{"$f":"IF(ISNUMBER(SEARCH(\"Survey with experts/Expert opinion\",'Data extraction-synthesis'!K44)),\"X\",\"\")","v":""},{"$f":"IF(ISNUMBER(SEARCH(\"Ethnographic interviews\",'Data extraction-synthesis'!K44)),\"X\",\"\")","v":""},{"$f":"IF(ISNUMBER(SEARCH(\"Reports\",'Data extraction-synthesis'!K44)),\"X\",\"\")","v":""},{"$f":"IF(ISNUMBER(SEARCH(\"Questionnaire provided to expert\",'Data extraction-synthesis'!K44)),\"X\",\"\")","v":""},{"$f":"IF(ISNUMBER(SEARCH(\"Field research\",'Data extraction-synthesis'!K44)),\"X\",\"\")","v":""},{"$f":"IF(ISNUMBER(SEARCH(\"Policies\",'Data extraction-synthesis'!K44)),\"X\",\"\")","v":""},{"$f":"IF(ISNUMBER(SEARCH(\"Websites of developers\",'Data extraction-synthesis'!K44)),\"X\",\"\")","v":""},{"$f":"IF(ISNUMBER(SEARCH(\"Data available\",'Data extraction-synthesis'!K44)),\"X\",\"\")","v":""},{"$f":"IF(ISNUMBER(SEARCH(\"No scoping phase reported\",'Data extraction-synthesis'!K44)),\"X\",\"\")","v":"X"},{"$f":"IF(ISNUMBER(SEARCH(\"N/A\",'Data extraction-synthesis'!K44)),\"X\",\"\")","v":""},"N/A"]
["WHO, FIND, Medecins sans Frontiers","A Multiplex Multi-Analyte Diagnostic Platform",{"$f":"IF(ISNUMBER(SEARCH(\"Literature\",'Data extraction-synthesis'!K45)),\"X\",\"\")","v":""},{"$f":"IF(ISNUMBER(SEARCH(\"Interviews with experts\",'Data extraction-synthesis'!K45)),\"X\",\"\")","v":""},{"$f":"IF(ISNUMBER(SEARCH(\"Survey with experts/Expert opinion\",'Data extraction-synthesis'!K45)),\"X\",\"\")","v":""},{"$f":"IF(ISNUMBER(SEARCH(\"Ethnographic interviews\",'Data extraction-synthesis'!K45)),\"X\",\"\")","v":""},{"$f":"IF(ISNUMBER(SEARCH(\"Reports\",'Data extraction-synthesis'!K45)),\"X\",\"\")","v":""},{"$f":"IF(ISNUMBER(SEARCH(\"Questionnaire provided to expert\",'Data extraction-synthesis'!K45)),\"X\",\"\")","v":""},{"$f":"IF(ISNUMBER(SEARCH(\"Field research\",'Data extraction-synthesis'!K45)),\"X\",\"\")","v":""},{"$f":"IF(ISNUMBER(SEARCH(\"Policies\",'Data extraction-synthesis'!K45)),\"X\",\"\")","v":""},{"$f":"IF(ISNUMBER(SEARCH(\"Websites of developers\",'Data extraction-synthesis'!K45)),\"X\",\"\")","v":""},{"$f":"IF(ISNUMBER(SEARCH(\"Data available\",'Data extraction-synthesis'!K45)),\"X\",\"\")","v":""},{"$f":"IF(ISNUMBER(SEARCH(\"No scoping phase reported\",'Data extraction-synthesis'!K45)),\"X\",\"\")","v":"X"},{"$f":"IF(ISNUMBER(SEARCH(\"N/A\",'Data extraction-synthesis'!K45)),\"X\",\"\")","v":""},"N/A"]
[null,"TOT",{"$f":"COUNTIF(C3:C46,\"X\")","v":8},{"$f":"COUNTIF(D3:D46,\"X\")","v":3},15,1,2,1,1,1,1,1,22,0]
[null,null,{"$f":"C47/22","v":{"v":0.36363636363636365,"d":"36%"}},{"v":0.13636363636363635,"d":"14%"},{"v":0.6818181818181818,"d":"68%"},{"v":0.045454545454545456,"d":"5%"},{"v":0.09090909090909091,"d":"9%"},{"v":0.045454545454545456,"d":"5%"},{"v":0.045454545454545456,"d":"5%"},{"v":0.045454545454545456,"d":"5%"},{"v":0.045454545454545456,"d":"5%"},{"v":0.045454545454545456,"d":"5%"},{"$f":"M47/22","v":{"v":1,"d":"100%"}},{"$f":"N47/22","v":{"v":0,"d":"0%"}}]

{"sheet":"Input source drafting TPP","index":2,"n_rows":48,"n_cols":25,"rows_kept":48,"merged":[[0,2,0,13]]}
[null,null,"INPUT SOURCE TO POPULATE TPP"]
["Authors","Article title","Literature","Industry standard","Guidelines","Consensus meeting inputs","Expert opinion","Meeting input","Available data","Field observations","Laboratory evaluations","Models ","Early usability studies ","No input sources reported","More than 1 input source?","% STUDIES WITH 1 INPUT SOURCE","% STUDIES WITH >1 INPUT SOURCE",null,null,"Systematic literature review? ","Which only-one input sources"]
["Chua, A. P., I.: Nuebling, C. M.: Wood, D.: Moussy, F.","Update on Zika Diagnostic Tests and WHO's Related Activities",{"$f":"IF(ISNUMBER(SEARCH(\"Literature\",'Data extraction-synthesis'!$I$2)),\"X\",\"\")","v":"X"},{"$f":"IF(ISNUMBER(SEARCH(\"Industry standard\",'Data extraction-synthesis'!I2)),\"X\",\"\")","v":""},{"$f":"IF(ISNUMBER(SEARCH(\"Guidelines\",'Data extraction-synthesis'!$I$2)),\"X\",\"\")","v":""},{"$f":"IF(ISNUMBER(SEARCH(\"Consensus meeting inputs\",'Data extraction-synthesis'!$I$2)),\"X\",\"\")","v":""},null,{"$f":"IF(ISNUMBER(SEARCH(\"Meeting input\",'Data extraction-synthesis'!I2)),\"X\",\"\")","v":"X"},{"$f":"IF(ISNUMBER(SEARCH(\"Available data\",'Data extraction-synthesis'!$I$2)),\"X\",\"\")","v":""},{"$f":"IF(ISNUMBER(SEARCH(\"Field observations\",'Data extraction-synthesis'!$I$2)),\"X\",\"\")","v":""},{"$f":"IF(ISNUMBER(SEARCH(\"Laboratory evaluations\",'Data extraction-synthesis'!$I$2)),\"X\",\"\")","v":""},{"$f":"IF(ISNUMBER(SEARCH(\"Models\",'Data extraction-synthesis'!I2)),\"X\",\"\")","v":""},{"$f":"IF(ISNUMBER(SEARCH(\"Early usability studies\",'Data extraction-synthesis'!$I$2)),\"X\",\"\")","v":""},{"$f":"IF(ISNUMBER(SEARCH(\"No input sources reported\",'Data extraction-synthesis'!I2)),\"X\",\"\")","v":""},{"$f":"IF(N3=\"X\",\"N/A\",IF((COUNTIF(C3:N3,\"X\"))>1,\"YES\",\"NO\"))","v":"YES"},{"$f":"COUNTIF(O3:O46,\"NO\")/44","v":{"v":0.20454545454545456,"d":"20%"}},{"$f":"COUNTIF(O3:O46,\"YES\")/44","v":{"v":0.5454545454545454,"d":"55%"}},{"$f":"Q3*44","v":24},null,"No, only citing literature",{"$nulls":3},"Number of TPPs which provided some information on input source"]
["Denkinger, C. M. D., D.: Schito, M.: Wells, W.: Cobelens, F.: Pai, M.: Zignol, M.: Cirillo, D. M.: Alland, D.: Casenghi, M.: Gallarda, J.: Boehme, C. C.: Perkins, M. D","Target Product Profile of a Molecular Drug-Susceptibility Test for Use in Microscopy Centers",{"$f":"IF(ISNUMBER(SEARCH(\"Literature\",'Data extraction-synthesis'!I3)),\"X\",\"\")","v":"X"},{"$f":"IF(ISNUMBER(SEARCH(\"Industry standard\",'Data extraction-synthesis'!I3)),\"X\",\"\")","v":""},{"$f":"IF(ISNUMBER(SEARCH(\"Guidelines\",'Data extraction-synthesis'!I3)),\"X\",\"\")","v":""},{"$f":"IF(ISNUMBER(SEARCH(\"Consensus meeting inputs\",'Data extraction-synthesis'!I3)),\"X\",\"\")","v":""},"X",{"$f":"IF(ISNUMBER(SEARCH(\"Meeting input\",'Data extraction-synthesis'!I3)),\"X\",\"\")","v":""},{"$f":"IF(ISNUMBER(SEARCH(\"Available data\",'Data extraction-synthesis'!I3)),\"X\",\"\")","v":""},{"$f":"IF(ISNUMBER(SEARCH(\"Field observations\",'Data extraction-synthesis'!I3)),\"X\",\"\")","v":""},{"$f":"IF(ISNUMBER(SEARCH(\"Laboratory evaluations\",'Data extraction-synthesis'!I3)),\"X\",\"\")","v":""},{"$f":"IF(ISNUMBER(SEARCH(\"Models\",'Data extraction-synthesis'!I3)),\"X\",\"\")","v":"X"},{"$f":"IF(ISNUMBER(SEARCH(\"Early usability studies\",'Data extraction-synthesis'!I3)),\"X\",\"\")","v":""},{"$f":"IF(ISNUMBER(SEARCH(\"No input sources reported\",'Data extraction-synthesis'!I3)),\"X\",\"\")","v":""},"YES",{"$f":"P3*44","v":9},null,{"$f":"P3*44","v":9},null,"No, only citing literature",null,null,"Drafting",{"$f":"COUNTIF(N3:N46,\"\")","v":33},{"$f":"X4/44","v":{"v":0.75,"d":"75%"}}]
["Denkinger, C. M. K., Sandra V.: Cirillo, Daniela Maria: Casenghi, Martina: Shinnick, Thomas: Weyer, Karin: Gilpin, Chris: Boehme, Catharina C.: Schito, Marco: Kimerling, Michael: Pai, Madhuka","Defining the needs for next generation assays for tuberculosis",{"$f":"IF(ISNUMBER(SEARCH(\"Literature\",'Data extraction-synthesis'!I4)),\"X\",\"\")","v":"X"},{"$f":"IF(ISNUMBER(SEARCH(\"Industry standard\",'Data extraction-synthesis'!I4)),\"X\",\"\")","v":""},{"$f":"IF(ISNUMBER(SEARCH(\"Guidelines\",'Data extraction-synthesis'!I4)),\"X\",\"\")","v":""},{"$f":"IF(ISNUMBER(SEARCH(\"Consensus meeting inputs\",'Data extraction-synthesis'!I4)),\"X\",\"\")","v":""},"X",{"$f":"IF(ISNUMBER(SEARCH(\"Meeting input\",'Data extraction-synthesis'!I4)),\"X\",\"\")","v":""},{"$f":"IF(ISNUMBER(SEARCH(\"Available data\",'Data extraction-synthesis'!I4)),\"X\",\"\")","v":""},{"$f":"IF(ISNUMBER(SEARCH(\"Field observations\",'Data extraction-synthesis'!I4)),\"X\",\"\")","v":""},{"$f":"IF(ISNUMBER(SEARCH(\"Laboratory evaluations\",'Data extraction-synthesis'!I4)),\"X\",\"\")","v":""},{"$f":"IF(ISNUMBER(SEARCH(\"Models\",'Data extraction-synthesis'!I4)),\"X\",\"\")","v":"X"},{"$f":"IF(ISNUMBER(SEARCH(\"Early usability studies\",'Data extraction-synthesis'!I4)),\"X\",\"\")","v":""},{"$f":"IF(ISNUMBER(SEARCH(\"No input sources reported\",'Data extraction-synthesis'!I4)),\"X\",\"\")","v":""},"YES",{"$f":"3/5","v":0.6},null,null,{"$f":"9/44","v":{"v":0.20454545454545456,"d":"20%"}},"No, only citing literature. It mentions only literature searches",null,null,"Scoping",{"$f":"COUNTIF('Input TPP scoping phase source'!M3:M46,\"\")","v":22},{"$f":"X5/44","v":{"v":0.5,"d":"50%"}}]
["DIAMETER Project, PATH","Point-of-Care Malaria Infection Detection Test For rapid detection of low-density, subclinical malaria infections",{"$f":"IF(ISNUMBER(SEARCH(\"Literature\",'Data extraction-synthesis'!I5)),\"X\",\"\")","v":"X"},{"$f":"IF(ISNUMBER(SEARCH(\"Industry standard\",'Data extraction-synthesis'!I5)),\"X\",\"\")","v":""},{"$f":"IF(ISNUMBER(SEARCH(\"Guidelines\",'Data extraction-synthesis'!I5)),\"X\",\"\")","v":""},{"$f":"IF(ISNUMBER(SEARCH(\"Consensus meeting inputs\",'Data extraction-synthesis'!I5)),\"X\",\"\")","v":""},"",{"$f":"IF(ISNUMBER(SEARCH(\"Meeting input\",'Data extraction-synthesis'!I5)),\"X\",\"\")","v":""},{"$f":"IF(ISNUMBER(SEARCH(\"Available data\",'Data extraction-synthesis'!I5)),\"X\",\"\")","v":"X"},{"$f":"IF(ISNUMBER(SEARCH(\"Field observations\",'Data extraction-synthesis'!I5)),\"X\",\"\")","v":"X"},{"$f":"IF(ISNUMBER(SEARCH(\"Laboratory evaluations\",'Data extraction-synthesis'!I5)),\"X\",\"\")","v":""},{"$f":"IF(ISNUMBER(SEARCH(\"Models\",'Data extraction-synthesis'!I5)),\"X\",\"\")","v":"X"},{"$f":"IF(ISNUMBER(SEARCH(\"Early usability studies\",'Data extraction-synthesis'!I5)),\"X\",\"\")","v":""},{"$f":"IF(ISNUMBER(SEARCH(\"No input sources reported\",'Data extraction-synthesis'!I5)),\"X\",\"\")","v":""},"YES",{"$nulls":4},"No, only citing literature",null,null,"Accuracy-related charact",{"$f":"COUNTIFS('Input source diagn accuracy'!N3:N46,\"\",'Input source diagn accuracy'!O3:O46,\"\")","v":18},{"$f":"X6/44","v":{"v":0.4090909090909091,"d":"41%"}}]
["Ding, X. C. A., Maria Paz: Baird, J. Kevin: Cheng, Qin: Cunningham, Jane: Dhorda, Mehul: Drakeley, Chris: Felger, Ingrid: Gamboa, Dionicia: Harbers, Matthias: Herrera, Socrates: Lucchi, Naomi: Mayor, Alfredo: Mueller, Ivo: Sattabongkot, Jetsumon: Ratsimbason, Arsène: Richards, Jack: Tanner, Marcel: González, Iveth J.","Defining the next generation of Plasmodium vivax diagnostic tests for control and elimination: Target product profiles",{"$f":"IF(ISNUMBER(SEARCH(\"Literature\",'Data extraction-synthesis'!I6)),\"X\",\"\")","v":"X"},{"$f":"IF(ISNUMBER(SEARCH(\"Industry standard\",'Data extraction-synthesis'!I6)),\"X\",\"\")","v":""},{"$f":"IF(ISNUMBER(SEARCH(\"Guidelines\",'Data extraction-synthesis'!I6)),\"X\",\"\")","v":""},{"$f":"IF(ISNUMBER(SEARCH(\"Consensus meeting inputs\",'Data extraction-synthesis'!I6)),\"X\",\"\")","v":""},"X",{"$f":"IF(ISNUMBER(SEARCH(\"Meeting input\",'Data extraction-synthesis'!I6)),\"X\",\"\")","v":""},{"$f":"IF(ISNUMBER(SEARCH(\"Available data\",'Data extraction-synthesis'!I6)),\"X\",\"\")","v":""},{"$f":"IF(ISNUMBER(SEARCH(\"Field observations\",'Data extraction-synthesis'!I6)),\"X\",\"\")","v":""},{"$f":"IF(ISNUMBER(SEARCH(\"Laboratory evaluations\",'Data extraction-synthesis'!I6)),\"X\",\"\")","v":""},{"$f":"IF(ISNUMBER(SEARCH(\"Models\",'Data extraction-synthesis'!I6)),\"X\",\"\")","v":"X"},{"$f":"IF(ISNUMBER(SEARCH(\"Early usability studies\",'Data extraction-synthesis'!I6)),\"X\",\"\")","v":""},{"$f":"IF(ISNUMBER(SEARCH(\"No input sources reported\",'Data extraction-synthesis'!I6)),\"X\",\"\")","v":""},"YES",{"$nulls":4},"No, only citing literature in the main text"]
["Dittrich, S. T., B. T.: Moussy, F.: Chua, A.: Zorzet, A.: Tangden, T.: Dolinger, D. L.: Page, A. L.: Crump, J. A.: Valerie, D.: Bassat, Q.: Lubell, Y.: Heinrich, N.: Newton, P. N.: Rodwell, T.: Gonzalez, I. J.","Target Product Profile for a Diagnostic Assay to Differentiate between Bacterial and Non-Bacterial Infections to Guide Antimicrobials Use in Resource-Limited Settings: An Expert Consensus",{"$f":"IF(ISNUMBER(SEARCH(\"Literature\",'Data extraction-synthesis'!I7)),\"X\",\"\")","v":"X"},{"$f":"IF(ISNUMBER(SEARCH(\"Industry standard\",'Data extraction-synthesis'!I7)),\"X\",\"\")","v":"X"},{"$f":"IF(ISNUMBER(SEARCH(\"Guidelines\",'Data extraction-synthesis'!I7)),\"X\",\"\")","v":""},{"$f":"IF(ISNUMBER(SEARCH(\"Consensus meeting inputs\",'Data extraction-synthesis'!I7)),\"X\",\"\")","v":""},"X",{"$f":"IF(ISNUMBER(SEARCH(\"Meeting input\",'Data extraction-synthesis'!I7)),\"X\",\"\")","v":""},{"$f":"IF(ISNUMBER(SEARCH(\"Available data\",'Data extraction-synthesis'!I7)),\"X\",\"\")","v":""},{"$f":"IF(ISNUMBER(SEARCH(\"Field observations\",'Data extraction-synthesis'!I7)),\"X\",\"\")","v":""},{"$f":"IF(ISNUMBER(SEARCH(\"Laboratory evaluations\",'Data extraction-synthesis'!I7)),\"X\",\"\")","v":""},{"$f":"IF(ISNUMBER(SEARCH(\"Models\",'Data extraction-synthesis'!I7)),\"X\",\"\")","v":""},{"$f":"IF(ISNUMBER(SEARCH(\"Early usability studies\",'Data extraction-synthesis'!I7)),\"X\",\"\")","v":""},{"$f":"IF(ISNUMBER(SEARCH(\"No input sources reported\",'Data extraction-synthesis'!I7)),\"X\",\"\")","v":""},"YES",{"$nulls":4},"No, only citing literature"]
["FIND","High-priority target product profile for hepatitis C diagnosis in decentralized settings: Report of a consensus meeting. ",{"$f":"IF(ISNUMBER(SEARCH(\"Literature\",'Data extraction-synthesis'!I8)),\"X\",\"\")","v":"X"},{"$f":"IF(ISNUMBER(SEARCH(\"Industry standard\",'Data extraction-synthesis'!I8)),\"X\",\"\")","v":""},{"$f":"IF(ISNUMBER(SEARCH(\"Guidelines\",'Data extraction-synthesis'!I8)),\"X\",\"\")","v":""},{"$f":"IF(ISNUMBER(SEARCH(\"Consensus meeting inputs\",'Data extraction-synthesis'!I8)),\"X\",\"\")","v":""},"X",{"$f":"IF(ISNUMBER(SEARCH(\"Meeting input\",'Data extraction-synthesis'!I8)),\"X\",\"\")","v":""},{"$f":"IF(ISNUMBER(SEARCH(\"Available data\",'Data extraction-synthesis'!I8)),\"X\",\"\")","v":""},{"$f":"IF(ISNUMBER(SEARCH(\"Field observations\",'Data extraction-synthesis'!I8)),\"X\",\"\")","v":""},{"$f":"IF(ISNUMBER(SEARCH(\"Laboratory evaluations\",'Data extraction-synthesis'!I8)),\"X\",\"\")","v":""},{"$f":"IF(ISNUMBER(SEARCH(\"Models\",'Data extraction-synthesis'!I8)),\"X\",\"\")","v":"X"},{"$f":"IF(ISNUMBER(SEARCH(\"Early usability studies\",'Data extraction-synthesis'!I8)),\"X\",\"\")","v":""},{"$f":"IF(ISNUMBER(SEARCH(\"No input sources reported\",'Data extraction-synthesis'!I8)),\"X\",\"\")","v":""},"YES",{"$nulls":4},"No, only citing literature in the main text"]
["Gal, M. F., N. A.: Hood, K.: Villacian, J.: Goossens, H.: Watkins, A.: Butler, C. C.","Matching diagnostics development to clinical need: Target product profile development for a point of care test for community-acquired lower respiratory tract infection",{"$f":"IF(ISNUMBER(SEARCH(\"Literature\",'Data extraction-synthesis'!I9)),\"X\",\"\")","v":"X"},{"$f":"IF(ISNUMBER(SEARCH(\"Industry standard\",'Data extraction-synthesis'!I9)),\"X\",\"\")","v":""},{"$f":"IF(ISNUMBER(SEARCH(\"Guidelines\",'Data extraction-synthesis'!I9)),\"X\",\"\")","v":""},{"$f":"IF(ISNUMBER(SEARCH(\"Consensus meeting inputs\",'Data extraction-synthesis'!I9)),\"X\",\"\")","v":""},"X",{"$f":"IF(ISNUMBER(SEARCH(\"Meeting input\",'Data extraction-synthesis'!I9)),\"X\",\"\")","v":"X"},{"$f":"IF(ISNUMBER(SEARCH(\"Available data\",'Data extraction-synthesis'!I9)),\"X\",\"\")","v":""},{"$f":"IF(ISNUMBER(SEARCH(\"Field observations\",'Data extraction-synthesis'!I9)),\"X\",\"\")","v":""},{"$f":"IF(ISNUMBER(SEARCH(\"Laboratory evaluations\",'Data extraction-synthesis'!I9)),\"X\",\"\")","v":""},{"$f":"IF(ISNUMBER(SEARCH(\"Models\",'Data extraction-synthesis'!I9)),\"X\",\"\")","v":""},{"$f":"IF(ISNUMBER(SEARCH(\"Early usability studies\",'Data extraction-synthesis'!I9)),\"X\",\"\")","v":""},{"$f":"IF(ISNUMBER(SEARCH(\"No input sources reported\",'Data extraction-synthesis'!I9)),\"X\",\"\")","v":""},"YES",{"$nulls":4},"No, only citing literature"]
["Lim, M. D. B., S. J.: Belizario, V. Y., Jr.: Gay-Andrieu, F.: Gilleard, J.: Levecke, B.: Lieshout, L. van: Medley, G. F.: Mekonnen, Z.: Mirams, G.: Njenga, S. M.: Odiere, M. R.: Rudge, J. W.: Stuyver, L.: Vercruysse, J.: Vlaminck, J.: Walson, J. L. ","Diagnostic tools for soil-transmitted helminths control and elimination programs: a pathway for diagnostic product development",{"$f":"IF(ISNUMBER(SEARCH(\"Literature\",'Data extraction-synthesis'!I10)),\"X\",\"\")","v":"X"},{"$f":"IF(ISNUMBER(SEARCH(\"Industry standard\",'Data extraction-synthesis'!I10)),\"X\",\"\")","v":""},{"$f":"IF(ISNUMBER(SEARCH(\"Guidelines\",'Data extraction-synthesis'!I10)),\"X\",\"\")","v":"X"},{"$f":"IF(ISNUMBER(SEARCH(\"Consensus meeting inputs\",'Data extraction-synthesis'!I10)),\"X\",\"\")","v":""},"X",{"$f":"IF(ISNUMBER(SEARCH(\"Meeting input\",'Data extraction-synthesis'!I10)),\"X\",\"\")","v":"X"},{"$f":"IF(ISNUMBER(SEARCH(\"Available data\",'Data extraction-synthesis'!I10)),\"X\",\"\")","v":""},{"$f":"IF(ISNUMBER(SEARCH(\"Field observations\",'Data extraction-synthesis'!I10)),\"X\",\"\")","v":""},{"$f":"IF(ISNUMBER(SEARCH(\"Laboratory evaluations\",'Data extraction-synthesis'!I10)),\"X\",\"\")","v":""},{"$f":"IF(ISNUMBER(SEARCH(\"Models\",'Data extraction-synthesis'!I10)),\"X\",\"\")","v":""},{"$f":"IF(ISNUMBER(SEARCH(\"Early usability studies\",'Data extraction-synthesis'!I10)),\"X\",\"\")","v":""},{"$f":"IF(ISNUMBER(SEARCH(\"No input sources reported\",'Data extraction-synthesis'!I10)),\"X\",\"\")","v":""},"YES",{"$nulls":4},"No, only citing literature in the table and main text"]
["Nsanzabana, C. A., Frederic: Beck, Hans-Peter: Ding, Xavier C.: Kamau, Edwin: Krishna, Sanjeev: Legrand, Eric: Lucchi, Naomi: Miotto, Olivo: Nag, Sidsel: Noedl, Harald: Roper, Cally: Rosenthal, Philip J.: Schallig, Henk D. F. H.: Taylor, Steve M.: Volkman, Sarah K.: Gonzalez, Iveth J.","Molecular assays for antimalarial drug resistance surveillance: A target product profile",{"$f":"IF(ISNUMBER(SEARCH(\"Literature\",'Data extraction-synthesis'!I11)),\"X\",\"\")","v":"X"},{"$f":"IF(ISNUMBER(SEARCH(\"Industry standard\",'Data extraction-synthesis'!I11)),\"X\",\"\")","v":""},{"$f":"IF(ISNUMBER(SEARCH(\"Guidelines\",'Data extraction-synthesis'!I11)),\"X\",\"\")","v":""},{"$f":"IF(ISNUMBER(SEARCH(\"Consensus meeting inputs\",'Data extraction-synthesis'!I11)),\"X\",\"\")","v":""},"",{"$f":"IF(ISNUMBER(SEARCH(\"Meeting input\",'Data extraction-synthesis'!I11)),\"X\",\"\")","v":""},{"$f":"IF(ISNUMBER(SEARCH(\"Available data\",'Data extraction-synthesis'!I11)),\"X\",\"\")","v":""},{"$f":"IF(ISNUMBER(SEARCH(\"Field observations\",'Data extraction-synthesis'!I11)),\"X\",\"\")","v":""},{"$f":"IF(ISNUMBER(SEARCH(\"Laboratory evaluations\",'Data extraction-synthesis'!I11)),\"X\",\"\")","v":""},{"$f":"IF(ISNUMBER(SEARCH(\"Models\",'Data extraction-synthesis'!I11)),\"X\",\"\")","v":""},{"$f":"IF(ISNUMBER(SEARCH(\"Early usability studies\",'Data extraction-synthesis'!I11)),\"X\",\"\")","v":""},{"$f":"IF(ISNUMBER(SEARCH(\"No input sources reported\",'Data extraction-synthesis'!I11)),\"X\",\"\")","v":""},"NO",{"$nulls":4},"No, only citing literature "]
["Porras, A. I. Y., Z. E.: Altcheh, J.: Britto, C.: Chaves, G. C.: Flevaud, L.: Martins, O. A.: Ribeiro, I.: Schijman, A. G.: Shikanai-Yasuda, M. A.: Sosa-Estani, S.: Stobbaerts, E.: Zicker, F.","Target Product Profile (TPP) for Chagas Disease Point-of-Care Diagnosis and Assessment of Response to Treatmen",{"$f":"IF(ISNUMBER(SEARCH(\"Literature\",'Data extraction-synthesis'!I12)),\"X\",\"\")","v":""},{"$f":"IF(ISNUMBER(SEARCH(\"Industry standard\",'Data extraction-synthesis'!I12)),\"X\",\"\")","v":""},{"$f":"IF(ISNUMBER(SEARCH(\"Guidelines\",'Data extraction-synthesis'!I12)),\"X\",\"\")","v":""},{"$f":"IF(ISNUMBER(SEARCH(\"Consensus meeting inputs\",'Data extraction-synthesis'!I12)),\"X\",\"\")","v":""},null,{"$f":"IF(ISNUMBER(SEARCH(\"Meeting input\",'Data extraction-synthesis'!I12)),\"X\",\"\")","v":"X"},{"$f":"IF(ISNUMBER(SEARCH(\"Available data\",'Data extraction-synthesis'!I12)),\"X\",\"\")","v":""},{"$f":"IF(ISNUMBER(SEARCH(\"Field observations\",'Data extraction-synthesis'!I12)),\"X\",\"\")","v":""},{"$f":"IF(ISNUMBER(SEARCH(\"Laboratory evaluations\",'Data extraction-synthesis'!I12)),\"X\",\"\")","v":""},{"$f":"IF(ISNUMBER(SEARCH(\"Models\",'Data extraction-synthesis'!I12)),\"X\",\"\")","v":""},{"$f":"IF(ISNUMBER(SEARCH(\"Early usability studies\",'Data extraction-synthesis'!I12)),\"X\",\"\")","v":""},{"$f":"IF(ISNUMBER(SEARCH(\"No input sources reported\",'Data extraction-synthesis'!I12)),\"X\",\"\")","v":""},"NO",{"$nulls":5},"Meeting input"]
["Reipold, E. I. E., Philippa: Trianni, Alessandra: Panneer, Nivedha: Krakower, Douglas: Ongarello, Stefano: Roberts, Teri: Miller, Veronica: Denkinger, Claudia","Optimising diagnosis of viraemic hepatitis C infection: the development of a target product profile",{"$f":"IF(ISNUMBER(SEARCH(\"Literature\",'Data extraction-synthesis'!I13)),\"X\",\"\")","v":"X"},{"$f":"IF(ISNUMBER(SEARCH(\"Industry standard\",'Data extraction-synthesis'!I13)),\"X\",\"\")","v":""},{"$f":"IF(ISNUMBER(SEARCH(\"Guidelines\",'Data extraction-synthesis'!I13)),\"X\",\"\")","v":""},{"$f":"IF(ISNUMBER(SEARCH(\"Consensus meeting inputs\",'Data extraction-synthesis'!I13)),\"X\",\"\")","v":""},"X",{"$f":"IF(ISNUMBER(SEARCH(\"Meeting input\",'Data extraction-synthesis'!I13)),\"X\",\"\")","v":""},{"$f":"IF(ISNUMBER(SEARCH(\"Available data\",'Data extraction-synthesis'!I13)),\"X\",\"\")","v":""},{"$f":"IF(ISNUMBER(SEARCH(\"Field observations\",'Data extraction-synthesis'!I13)),\"X\",\"\")","v":""},{"$f":"IF(ISNUMBER(SEARCH(\"Laboratory evaluations\",'Data extraction-synthesis'!I13)),\"X\",\"\")","v":""},{"$f":"IF(ISNUMBER(SEARCH(\"Models\",'Data extraction-synthesis'!I13)),\"X\",\"\")","v":"X"},{"$f":"IF(ISNUMBER(SEARCH(\"Early usability studies\",'Data extraction-synthesis'!I13)),\"X\",\"\")","v":""},{"$f":"IF(ISNUMBER(SEARCH(\"No input sources reported\",'Data extraction-synthesis'!I13)),\"X\",\"\")","v":""},"YES",{"$nulls":4},"No, only citing literature in table and main text"]
["Solomon, A. W. E., D.: Bailey, R. L.: Blake, I. M.: Brooker, S.: Chen, J. X.: Chen, J. H.: Churcher, T. S.: Drakeley, C. J.: Edwards, T.: Fenwick, A.: French, M.: Gabrielli, A. F.: Grassly, N. C.: Harding-Esch, E. M.: Holland, M. J.: Koukounari, A.: Lammie, P. J.: Leslie, J.: Mabey, D. C.: Rhajaoui, M.: Secor, W. E.: Stothard, J. R.: Wei, H.: Willingham, A. L.: Zhou, X. N.: Peeling, R. W.","A diagnostics platform for the integrated mapping, monitoring, and surveillance of neglected tropical diseases: Rationale and target product profiles",{"$f":"IF(ISNUMBER(SEARCH(\"Literature\",'Data extraction-synthesis'!I14)),\"X\",\"\")","v":""},{"$f":"IF(ISNUMBER(SEARCH(\"Industry standard\",'Data extraction-synthesis'!I14)),\"X\",\"\")","v":""},{"$f":"IF(ISNUMBER(SEARCH(\"Guidelines\",'Data extraction-synthesis'!I14)),\"X\",\"\")","v":""},{"$f":"IF(ISNUMBER(SEARCH(\"Consensus meeting inputs\",'Data extraction-synthesis'!I14)),\"X\",\"\")","v":"X"},"",null,{"$f":"IF(ISNUMBER(SEARCH(\"Available data\",'Data extraction-synthesis'!I14)),\"X\",\"\")","v":""},{"$f":"IF(ISNUMBER(SEARCH(\"Field observations\",'Data extraction-synthesis'!I14)),\"X\",\"\")","v":""},{"$f":"IF(ISNUMBER(SEARCH(\"Laboratory evaluations\",'Data extraction-synthesis'!I14)),\"X\",\"\")","v":""},{"$f":"IF(ISNUMBER(SEARCH(\"Models\",'Data extraction-synthesis'!I14)),\"X\",\"\")","v":""},{"$f":"IF(ISNUMBER(SEARCH(\"Early usability studies\",'Data extraction-synthesis'!I14)),\"X\",\"\")","v":""},{"$f":"IF(ISNUMBER(SEARCH(\"No input sources reported\",'Data extraction-synthesis'!I14)),\"X\",\"\")","v":""},"NO"]
["Toskin, I. M., M.: Peeling, R. W.: Blondeel, K.: Cordero, J.: Kiarie, J.","Advancing prevention of sexually transmitted infections through point-of-care testing: target product profiles and landscape analysis",{"$f":"IF(ISNUMBER(SEARCH(\"Literature\",'Data extraction-synthesis'!I15)),\"X\",\"\")","v":"X"},{"$f":"IF(ISNUMBER(SEARCH(\"Industry standard\",'Data extraction-synthesis'!I15)),\"X\",\"\")","v":""},{"$f":"IF(ISNUMBER(SEARCH(\"Guidelines\",'Data extraction-synthesis'!I15)),\"X\",\"\")","v":""},{"$f":"IF(ISNUMBER(SEARCH(\"Consensus meeting inputs\",'Data extraction-synthesis'!I15)),\"X\",\"\")","v":"X"},"X",null,{"$f":"IF(ISNUMBER(SEARCH(\"Available data\",'Data extraction-synthesis'!I15)),\"X\",\"\")","v":""},{"$f":"IF(ISNUMBER(SEARCH(\"Field observations\",'Data extraction-synthesis'!I15)),\"X\",\"\")","v":""},{"$f":"IF(ISNUMBER(SEARCH(\"Laboratory evaluations\",'Data extraction-synthesis'!I15)),\"X\",\"\")","v":""},{"$f":"IF(ISNUMBER(SEARCH(\"Models\",'Data extraction-synthesis'!I15)),\"X\",\"\")","v":"X"},{"$f":"IF(ISNUMBER(SEARCH(\"Early usability studies\",'Data extraction-synthesis'!I15)),\"X\",\"\")","v":""},{"$f":"IF(ISNUMBER(SEARCH(\"No input sources reported\",'Data extraction-synthesis'!I15)),\"X\",\"\")","v":""},"YES",{"$nulls":4},"Review of pooled daa from systematic reviews commissioned by WHO"]
["Donadeu, M. F., A. S.: Olliaro, P. L.: Abela-Ridder, B","Target product profiles for the diagnosis of Taenia solium taeniasis, neurocysticercosis and porcine cysticercosis",{"$f":"IF(ISNUMBER(SEARCH(\"Literature\",'Data extraction-synthesis'!I16)),\"X\",\"\")","v":"X"},{"$f":"IF(ISNUMBER(SEARCH(\"Industry standard\",'Data extraction-synthesis'!I16)),\"X\",\"\")","v":""},{"$f":"IF(ISNUMBER(SEARCH(\"Guidelines\",'Data extraction-synthesis'!I16)),\"X\",\"\")","v":""},{"$f":"IF(ISNUMBER(SEARCH(\"Consensus meeting inputs\",'Data extraction-synthesis'!I16)),\"X\",\"\")","v":""},"X",{"$f":"IF(ISNUMBER(SEARCH(\"Meeting input\",'Data extraction-synthesis'!I16)),\"X\",\"\")","v":""},{"$f":"IF(ISNUMBER(SEARCH(\"Available data\",'Data extraction-synthesis'!I16)),\"X\",\"\")","v":""},{"$f":"IF(ISNUMBER(SEARCH(\"Field observations\",'Data extraction-synthesis'!I16)),\"X\",\"\")","v":""},{"$f":"IF(ISNUMBER(SEARCH(\"Laboratory evaluations\",'Data extraction-synthesis'!I16)),\"X\",\"\")","v":""},{"$f":"IF(ISNUMBER(SEARCH(\"Models\",'Data extraction-synthesis'!I16)),\"X\",\"\")","v":""},{"$f":"IF(ISNUMBER(SEARCH(\"Early usability studies\",'Data extraction-synthesis'!I16)),\"X\",\"\")","v":""},{"$f":"IF(ISNUMBER(SEARCH(\"No input sources reported\",'Data extraction-synthesis'!I16)),\"X\",\"\")","v":""},"YES",{"$nulls":4},"No, only citing literature in the table and main text"]
["FIND","Target Product Profile for Tests for Recent HIV Infection",{"$f":"IF(ISNUMBER(SEARCH(\"Literature\",'Data extraction-synthesis'!I17)),\"X\",\"\")","v":""},{"$f":"IF(ISNUMBER(SEARCH(\"Industry standard\",'Data extraction-synthesis'!I17)),\"X\",\"\")","v":""},{"$f":"IF(ISNUMBER(SEARCH(\"Guidelines\",'Data extraction-synthesis'!I17)),\"X\",\"\")","v":""},{"$f":"IF(ISNUMBER(SEARCH(\"Consensus meeting inputs\",'Data extraction-synthesis'!I17)),\"X\",\"\")","v":""},"X",{"$f":"IF(ISNUMBER(SEARCH(\"Meeting input\",'Data extraction-synthesis'!I17)),\"X\",\"\")","v":"X"},{"$f":"IF(ISNUMBER(SEARCH(\"Available data\",'Data extraction-synthesis'!I17)),\"X\",\"\")","v":""},{"$f":"IF(ISNUMBER(SEARCH(\"Field observations\",'Data extraction-synthesis'!I17)),\"X\",\"\")","v":""},{"$f":"IF(ISNUMBER(SEARCH(\"Laboratory evaluations\",'Data extraction-synthesis'!I17)),\"X\",\"\")","v":""},{"$f":"IF(ISNUMBER(SEARCH(\"Models\",'Data extraction-synthesis'!I17)),\"X\",\"\")","v":""},{"$f":"IF(ISNUMBER(SEARCH(\"Early usability studies\",'Data extraction-synthesis'!I17)),\"X\",\"\")","v":""},{"$f":"IF(ISNUMBER(SEARCH(\"No input sources reported\",'Data extraction-synthesis'!I17)),\"X\",\"\")","v":""},"YES"]
["FIND","Target Product Profile: Rapid test for diagnosis of malaria and screening for hyman African trypanosomiasis (HAT)",{"$f":"IF(ISNUMBER(SEARCH(\"Literature\",'Data extraction-synthesis'!I18)),\"X\",\"\")","v":""},{"$f":"IF(ISNUMBER(SEARCH(\"Industry standard\",'Data extraction-synthesis'!I18)),\"X\",\"\")","v":""},{"$f":"IF(ISNUMBER(SEARCH(\"Guidelines\",'Data extraction-synthesis'!I18)),\"X\",\"\")","v":""},{"$f":"IF(ISNUMBER(SEARCH(\"Consensus meeting inputs\",'Data extraction-synthesis'!I18)),\"X\",\"\")","v":""},"",{"$f":"IF(ISNUMBER(SEARCH(\"Meeting input\",'Data extraction-synthesis'!I18)),\"X\",\"\")","v":""},{"$f":"IF(ISNUMBER(SEARCH(\"Available data\",'Data extraction-synthesis'!I18)),\"X\",\"\")","v":""},{"$f":"IF(ISNUMBER(SEARCH(\"Field observations\",'Data extraction-synthesis'!I18)),\"X\",\"\")","v":""},{"$f":"IF(ISNUMBER(SEARCH(\"Laboratory evaluations\",'Data extraction-synthesis'!I18)),\"X\",\"\")","v":""},{"$f":"IF(ISNUMBER(SEARCH(\"Models\",'Data extraction-synthesis'!I18)),\"X\",\"\")","v":""},{"$f":"IF(ISNUMBER(SEARCH(\"Early usability studies\",'Data extraction-synthesis'!I18)),\"X\",\"\")","v":""},{"$f":"IF(ISNUMBER(SEARCH(\"No input sources reported\",'Data extraction-synthesis'!I18)),\"X\",\"\")","v":"X"},"N/A"]
["PATH","Target Product Profile: HIV Self-Test Version 4.1: A White Paper on the Evaluation of Current HIV Rapid Tests and Development of Core Specifications for Next-Generation HIV Tests",{"$f":"IF(ISNUMBER(SEARCH(\"Literature\",'Data extraction-synthesis'!I19)),\"X\",\"\")","v":"X"},{"$f":"IF(ISNUMBER(SEARCH(\"Industry standard\",'Data extraction-synthesis'!I19)),\"X\",\"\")","v":""},{"$f":"IF(ISNUMBER(SEARCH(\"Guidelines\",'Data extraction-synthesis'!I19)),\"X\",\"\")","v":""},{"$f":"IF(ISNUMBER(SEARCH(\"Consensus meeting inputs\",'Data extraction-synthesis'!I19)),\"X\",\"\")","v":""},"X",{"$f":"IF(ISNUMBER(SEARCH(\"Meeting input\",'Data extraction-synthesis'!I19)),\"X\",\"\")","v":""},{"$f":"IF(ISNUMBER(SEARCH(\"Available data\",'Data extraction-synthesis'!I19)),\"X\",\"\")","v":"X"},{"$f":"IF(ISNUMBER(SEARCH(\"Field observations\",'Data extraction-synthesis'!I19)),\"X\",\"\")","v":""},{"$f":"IF(ISNUMBER(SEARCH(\"Laboratory evaluations\",'Data extraction-synthesis'!I19)),\"X\",\"\")","v":"X"},{"$f":"IF(ISNUMBER(SEARCH(\"Models\",'Data extraction-synthesis'!I19)),\"X\",\"\")","v":""},{"$f":"IF(ISNUMBER(SEARCH(\"Early usability studies\",'Data extraction-synthesis'!I19)),\"X\",\"\")","v":"X"},{"$f":"IF(ISNUMBER(SEARCH(\"No input sources reported\",'Data extraction-synthesis'!I19)),\"X\",\"\")","v":""},"YES",{"$nulls":4},"\"Thoughtful review of currently available literature\", citing specific literature for each test characteristic"]
["PATH","Diagnostics for neglected tropical diseases: Defining the best tools through target product profiles",{"$f":"IF(ISNUMBER(SEARCH(\"Literature\",'Data extraction-synthesis'!I20)),\"X\",\"\")","v":""},{"$f":"IF(ISNUMBER(SEARCH(\"Industry standard\",'Data extraction-synthesis'!I20)),\"X\",\"\")","v":""},{"$f":"IF(ISNUMBER(SEARCH(\"Guidelines\",'Data extraction-synthesis'!I20)),\"X\",\"\")","v":""},{"$f":"IF(ISNUMBER(SEARCH(\"Consensus meeting inputs\",'Data extraction-synthesis'!I20)),\"X\",\"\")","v":""},"X",{"$f":"IF(ISNUMBER(SEARCH(\"Meeting input\",'Data extraction-synthesis'!I20)),\"X\",\"\")","v":""},{"$f":"IF(ISNUMBER(SEARCH(\"Available data\",'Data extraction-synthesis'!I20)),\"X\",\"\")","v":""},{"$f":"IF(ISNUMBER(SEARCH(\"Field observations\",'Data extraction-synthesis'!I20)),\"X\",\"\")","v":""},{"$f":"IF(ISNUMBER(SEARCH(\"Laboratory evaluations\",'Data extraction-synthesis'!I20)),\"X\",\"\")","v":""},{"$f":"IF(ISNUMBER(SEARCH(\"Models\",'Data extraction-synthesis'!I20)),\"X\",\"\")","v":""},{"$f":"IF(ISNUMBER(SEARCH(\"Early usability studies\",'Data extraction-synthesis'!I20)),\"X\",\"\")","v":""},{"$f":"IF(ISNUMBER(SEARCH(\"No input sources reported\",'Data extraction-synthesis'!I20)),\"X\",\"\")","v":""},"NO"]
["PATH","Target Product Profile: Schistosomiasis Surveillance Diagnostic",{"$f":"IF(ISNUMBER(SEARCH(\"Literature\",'Data extraction-synthesis'!I21)),\"X\",\"\")","v":"X"},{"$f":"IF(ISNUMBER(SEARCH(\"Industry standard\",'Data extraction-synthesis'!I21)),\"X\",\"\")","v":""},{"$f":"IF(ISNUMBER(SEARCH(\"Guidelines\",'Data extraction-synthesis'!I21)),\"X\",\"\")","v":"X"},{"$f":"IF(ISNUMBER(SEARCH(\"Consensus meeting inputs\",'Data extraction-synthesis'!I21)),\"X\",\"\")","v":""},"X",{"$f":"IF(ISNUMBER(SEARCH(\"Meeting input\",'Data extraction-synthesis'!I21)),\"X\",\"\")","v":""},{"$f":"IF(ISNUMBER(SEARCH(\"Available data\",'Data extraction-synthesis'!I21)),\"X\",\"\")","v":"X"},{"$f":"IF(ISNUMBER(SEARCH(\"Field observations\",'Data extraction-synthesis'!I21)),\"X\",\"\")","v":"X"},{"$f":"IF(ISNUMBER(SEARCH(\"Laboratory evaluations\",'Data extraction-synthesis'!I21)),\"X\",\"\")","v":""},{"$f":"IF(ISNUMBER(SEARCH(\"Models\",'Data extraction-synthesis'!I21)),\"X\",\"\")","v":""},{"$f":"IF(ISNUMBER(SEARCH(\"Early usability studies\",'Data extraction-synthesis'!I21)),\"X\",\"\")","v":""},{"$f":"IF(ISNUMBER(SEARCH(\"No input sources reported\",'Data extraction-synthesis'!I21)),\"X\",\"\")","v":""},"YES",{"$nulls":4},"No, only citing literature in the main text describing each test characteristic"]
["UNICEF","UNICEF Target Product Profile Rapid E.coli Detection (version 2.0)",{"$f":"IF(ISNUMBER(SEARCH(\"Literature\",'Data extraction-synthesis'!I22)),\"X\",\"\")","v":""},{"$f":"IF(ISNUMBER(SEARCH(\"Industry standard\",'Data extraction-synthesis'!I22)),\"X\",\"\")","v":""},{"$f":"IF(ISNUMBER(SEARCH(\"Guidelines\",'Data extraction-synthesis'!I22)),\"X\",\"\")","v":""},{"$f":"IF(ISNUMBER(SEARCH(\"Consensus meeting inputs\",'Data extraction-synthesis'!I22)),\"X\",\"\")","v":""},"",{"$f":"IF(ISNUMBER(SEARCH(\"Meeting input\",'Data extraction-synthesis'!I22)),\"X\",\"\")","v":""},{"$f":"IF(ISNUMBER(SEARCH(\"Available data\",'Data extraction-synthesis'!I22)),\"X\",\"\")","v":""},{"$f":"IF(ISNUMBER(SEARCH(\"Field observations\",'Data extraction-synthesis'!I22)),\"X\",\"\")","v":""},{"$f":"IF(ISNUMBER(SEARCH(\"Laboratory evaluations\",'Data extraction-synthesis'!I22)),\"X\",\"\")","v":""},{"$f":"IF(ISNUMBER(SEARCH(\"Models\",'Data extraction-synthesis'!I22)),\"X\",\"\")","v":""},{"$f":"IF(ISNUMBER(SEARCH(\"Early usability studies\",'Data extraction-synthesis'!I22)),\"X\",\"\")","v":""},{"$f":"IF(ISNUMBER(SEARCH(\"No input sources reported\",'Data extraction-synthesis'!I22)),\"X\",\"\")","v":"X"},"N/A"]
["UNICEF","UNICEF Target Product Profile Rapid E.coli Detection (1.4)",{"$f":"IF(ISNUMBER(SEARCH(\"Literature\",'Data extraction-synthesis'!I23)),\"X\",\"\")","v":""},{"$f":"IF(ISNUMBER(SEARCH(\"Industry standard\",'Data extraction-synthesis'!I23)),\"X\",\"\")","v":""},{"$f":"IF(ISNUMBER(SEARCH(\"Guidelines\",'Data extraction-synthesis'!I23)),\"X\",\"\")","v":""},{"$f":"IF(ISNUMBER(SEARCH(\"Consensus meeting inputs\",'Data extraction-synthesis'!I23)),\"X\",\"\")","v":""},"",{"$f":"IF(ISNUMBER(SEARCH(\"Meeting input\",'Data extraction-synthesis'!I23)),\"X\",\"\")","v":""},{"$f":"IF(ISNUMBER(SEARCH(\"Available data\",'Data extraction-synthesis'!I23)),\"X\",\"\")","v":""},{"$f":"IF(ISNUMBER(SEARCH(\"Field observations\",'Data extraction-synthesis'!I23)),\"X\",\"\")","v":""},{"$f":"IF(ISNUMBER(SEARCH(\"Laboratory evaluations\",'Data extraction-synthesis'!I23)),\"X\",\"\")","v":""},{"$f":"IF(ISNUMBER(SEARCH(\"Models\",'Data extraction-synthesis'!I23)),\"X\",\"\")","v":""},{"$f":"IF(ISNUMBER(SEARCH(\"Early usability studies\",'Data extraction-synthesis'!I23)),\"X\",\"\")","v":""},{"$f":"IF(ISNUMBER(SEARCH(\"No input sources reported\",'Data extraction-synthesis'!I23)),\"X\",\"\")","v":"X"},"N/A"]
["WHO","High-priority target product profile for new tubercolosis diagnostics: report of a consensus meeting",{"$f":"IF(ISNUMBER(SEARCH(\"Literature\",'Data extraction-synthesis'!I24)),\"X\",\"\")","v":"X"},{"$f":"IF(ISNUMBER(SEARCH(\"Industry standard\",'Data extraction-synthesis'!I24)),\"X\",\"\")","v":""},{"$f":"IF(ISNUMBER(SEARCH(\"Guidelines\",'Data extraction-synthesis'!I24)),\"X\",\"\")","v":""},{"$f":"IF(ISNUMBER(SEARCH(\"Consensus meeting inputs\",'Data extraction-synthesis'!I24)),\"X\",\"\")","v":"X"},"X",null,{"$f":"IF(ISNUMBER(SEARCH(\"Available data\",'Data extraction-synthesis'!I24)),\"X\",\"\")","v":""},{"$f":"IF(ISNUMBER(SEARCH(\"Field observations\",'Data extraction-synthesis'!I24)),\"X\",\"\")","v":""},{"$f":"IF(ISNUMBER(SEARCH(\"Laboratory evaluations\",'Data extraction-synthesis'!I24)),\"X\",\"\")","v":""},{"$f":"IF(ISNUMBER(SEARCH(\"Models\",'Data extraction-synthesis'!I24)),\"X\",\"\")","v":"X"},{"$f":"IF(ISNUMBER(SEARCH(\"Early usability studies\",'Data extraction-synthesis'!I24)),\"X\",\"\")","v":""},{"$f":"IF(ISNUMBER(SEARCH(\"No input sources reported\",'Data extraction-synthesis'!I24)),\"X\",\"\")","v":""},"YES",{"$nulls":4},"No, only citing literature in the main text in relation to some test characteristics and table"]
["WHO","Development of a Target Product Profile (TPP) and framework for evaluation for a test predicting progression from tubercolosis infection to active disease",{"$f":"IF(ISNUMBER(SEARCH(\"Literature\",'Data extraction-synthesis'!I25)),\"X\",\"\")","v":""},{"$f":"IF(ISNUMBER(SEARCH(\"Industry standard\",'Data extraction-synthesis'!I25)),\"X\",\"\")","v":""},{"$f":"IF(ISNUMBER(SEARCH(\"Guidelines\",'Data extraction-synthesis'!I25)),\"X\",\"\")","v":""},{"$f":"IF(ISNUMBER(SEARCH(\"Consensus meeting inputs\",'Data extraction-synthesis'!I25)),\"X\",\"\")","v":""},"X",{"$f":"IF(ISNUMBER(SEARCH(\"Meeting input\",'Data extraction-synthesis'!I25)),\"X\",\"\")","v":"X"},{"$f":"IF(ISNUMBER(SEARCH(\"Available data\",'Data extraction-synthesis'!I25)),\"X\",\"\")","v":""},{"$f":"IF(ISNUMBER(SEARCH(\"Field observations\",'Data extraction-synthesis'!I25)),\"X\",\"\")","v":""},{"$f":"IF(ISNUMBER(SEARCH(\"Laboratory evaluations\",'Data extraction-synthesis'!I25)),\"X\",\"\")","v":""},{"$f":"IF(ISNUMBER(SEARCH(\"Models\",'Data extraction-synthesis'!I25)),\"X\",\"\")","v":""},{"$f":"IF(ISNUMBER(SEARCH(\"Early usability studies\",'Data extraction-synthesis'!I25)),\"X\",\"\")","v":""},{"$f":"IF(ISNUMBER(SEARCH(\"No input sources reported\",'Data extraction-synthesis'!I25)),\"X\",\"\")","v":""},"YES"]
["WHO","Specifications for a rapid diagnostic test for meningitis African meningitis belt/ Target product profile for the development of a new generation of rapid test for the diagnosis of bacterial meningitis",{"$f":"IF(ISNUMBER(SEARCH(\"Literature\",'Data extraction-synthesis'!I26)),\"X\",\"\")","v":""},{"$f":"IF(ISNUMBER(SEARCH(\"Industry standard\",'Data extraction-synthesis'!I26)),\"X\",\"\")","v":""},{"$f":"IF(ISNUMBER(SEARCH(\"Guidelines\",'Data extraction-synthesis'!I26)),\"X\",\"\")","v":""},{"$f":"IF(ISNUMBER(SEARCH(\"Consensus meeting inputs\",'Data extraction-synthesis'!I26)),\"X\",\"\")","v":""},"",{"$f":"IF(ISNUMBER(SEARCH(\"Meeting input\",'Data extraction-synthesis'!I26)),\"X\",\"\")","v":""},{"$f":"IF(ISNUMBER(SEARCH(\"Available data\",'Data extraction-synthesis'!I26)),\"X\",\"\")","v":""},{"$f":"IF(ISNUMBER(SEARCH(\"Field observations\",'Data extraction-synthesis'!I26)),\"X\",\"\")","v":""},{"$f":"IF(ISNUMBER(SEARCH(\"Laboratory evaluations\",'Data extraction-synthesis'!I26)),\"X\",\"\")","v":""},{"$f":"IF(ISNUMBER(SEARCH(\"Models\",'Data extraction-synthesis'!I26)),\"X\",\"\")","v":""},{"$f":"IF(ISNUMBER(SEARCH(\"Early usability studies\",'Data extraction-synthesis'!I26)),\"X\",\"\")","v":""},{"$f":"IF(ISNUMBER(SEARCH(\"No input sources reported\",'Data extraction-synthesis'!I26)),\"X\",\"\")","v":"X"},"N/A"]
["WHO","Target Product Profile for Zaire ebolavirus rapid,simple test to be used in the control of the Ebola outbreak in West Africa",{"$f":"IF(ISNUMBER(SEARCH(\"Literature\",'Data extraction-synthesis'!I27)),\"X\",\"\")","v":""},{"$f":"IF(ISNUMBER(SEARCH(\"Industry standard\",'Data extraction-synthesis'!I27)),\"X\",\"\")","v":""},{"$f":"IF(ISNUMBER(SEARCH(\"Guidelines\",'Data extraction-synthesis'!I27)),\"X\",\"\")","v":""},{"$f":"IF(ISNUMBER(SEARCH(\"Consensus meeting inputs\",'Data extraction-synthesis'!I27)),\"X\",\"\")","v":""},"",{"$f":"IF(ISNUMBER(SEARCH(\"Meeting input\",'Data extraction-synthesis'!I27)),\"X\",\"\")","v":""},{"$f":"IF(ISNUMBER(SEARCH(\"Available data\",'Data extraction-synthesis'!I27)),\"X\",\"\")","v":""},{"$f":"IF(ISNUMBER(SEARCH(\"Field observations\",'Data extraction-synthesis'!I27)),\"X\",\"\")","v":""},{"$f":"IF(ISNUMBER(SEARCH(\"Laboratory evaluations\",'Data extraction-synthesis'!I27)),\"X\",\"\")","v":""},{"$f":"IF(ISNUMBER(SEARCH(\"Models\",'Data extraction-synthesis'!I27)),\"X\",\"\")","v":""},{"$f":"IF(ISNUMBER(SEARCH(\"Early usability studies\",'Data extraction-synthesis'!I27)),\"X\",\"\")","v":""},{"$f":"IF(ISNUMBER(SEARCH(\"No input sources reported\",'Data extraction-synthesis'!I27)),\"X\",\"\")","v":"X"},"N/A"]
["WHO","Report of WHO-FIND meeting on diagnostics for Buruli ulcer",{"$f":"IF(ISNUMBER(SEARCH(\"Literature\",'Data extraction-synthesis'!I28)),\"X\",\"\")","v":""},{"$f":"IF(ISNUMBER(SEARCH(\"Industry standard\",'Data extraction-synthesis'!I28)),\"X\",\"\")","v":""},{"$f":"IF(ISNUMBER(SEARCH(\"Guidelines\",'Data extraction-synthesis'!I28)),\"X\",\"\")","v":""},{"$f":"IF(ISNUMBER(SEARCH(\"Consensus meeting inputs\",'Data extraction-synthesis'!I28)),\"X\",\"\")","v":""},null,{"$f":"IF(ISNUMBER(SEARCH(\"Meeting input\",'Data extraction-synthesis'!I28)),\"X\",\"\")","v":"X"},{"$f":"IF(ISNUMBER(SEARCH(\"Available data\",'Data extraction-synthesis'!I28)),\"X\",\"\")","v":""},{"$f":"IF(ISNUMBER(SEARCH(\"Field observations\",'Data extraction-synthesis'!I28)),\"X\",\"\")","v":""},{"$f":"IF(ISNUMBER(SEARCH(\"Laboratory evaluations\",'Data extraction-synthesis'!I28)),\"X\",\"\")","v":""},{"$f":"IF(ISNUMBER(SEARCH(\"Models\",'Data extraction-synthesis'!I28)),\"X\",\"\")","v":""},{"$f":"IF(ISNUMBER(SEARCH(\"Early usability studies\",'Data extraction-synthesis'!I28)),\"X\",\"\")","v":""},{"$f":"IF(ISNUMBER(SEARCH(\"No input sources reported\",'Data extraction-synthesis'!I28)),\"X\",\"\")","v":""},"NO",{"$nulls":5},"Meeting input"]
["WHO","Taenia solium taeniasis/cysticercosis diagnostic tools. Report of a stakeholder meeting",{"$f":"IF(ISNUMBER(SEARCH(\"Literature\",'Data extraction-synthesis'!I29)),\"X\",\"\")","v":""},{"$f":"IF(ISNUMBER(SEARCH(\"Industry standard\",'Data extraction-synthesis'!I29)),\"X\",\"\")","v":""},{"$f":"IF(ISNUMBER(SEARCH(\"Guidelines\",'Data extraction-synthesis'!I29)),\"X\",\"\")","v":""},{"$f":"IF(ISNUMBER(SEARCH(\"Consensus meeting inputs\",'Data extraction-synthesis'!I29)),\"X\",\"\")","v":""},null,{"$f":"IF(ISNUMBER(SEARCH(\"Meeting input\",'Data extraction-synthesis'!I29)),\"X\",\"\")","v":"X"},{"$f":"IF(ISNUMBER(SEARCH(\"Available data\",'Data extraction-synthesis'!I29)),\"X\",\"\")","v":""},{"$f":"IF(ISNUMBER(SEARCH(\"Field observations\",'Data extraction-synthesis'!I29)),\"X\",\"\")","v":""},{"$f":"IF(ISNUMBER(SEARCH(\"Laboratory evaluations\",'Data extraction-synthesis'!I29)),\"X\",\"\")","v":""},{"$f":"IF(ISNUMBER(SEARCH(\"Models\",'Data extraction-synthesis'!I29)),\"X\",\"\")","v":""},{"$f":"IF(ISNUMBER(SEARCH(\"Early usability studies\",'Data extraction-synthesis'!I29)),\"X\",\"\")","v":""},{"$f":"IF(ISNUMBER(SEARCH(\"No input sources reported\",'Data extraction-synthesis'!I29)),\"X\",\"\")","v":""},"NO",{"$nulls":5},"Meeting input"]
["Utzinger, J. B., S. L.: van Lieshout, L.: van Dam, G. J.: Knopp, S","New diagnostic tools in schistosomiasis",{"$f":"IF(ISNUMBER(SEARCH(\"Literature\",'Data extraction-synthesis'!I30)),\"X\",\"\")","v":""},{"$f":"IF(ISNUMBER(SEARCH(\"Industry standard\",'Data extraction-synthesis'!I30)),\"X\",\"\")","v":""},{"$f":"IF(ISNUMBER(SEARCH(\"Guidelines\",'Data extraction-synthesis'!I30)),\"X\",\"\")","v":""},{"$f":"IF(ISNUMBER(SEARCH(\"Consensus meeting inputs\",'Data extraction-synthesis'!I30)),\"X\",\"\")","v":""},"",{"$f":"IF(ISNUMBER(SEARCH(\"Meeting input\",'Data extraction-synthesis'!I30)),\"X\",\"\")","v":""},{"$f":"IF(ISNUMBER(SEARCH(\"Available data\",'Data extraction-synthesis'!I30)),\"X\",\"\")","v":""},{"$f":"IF(ISNUMBER(SEARCH(\"Field observations\",'Data extraction-synthesis'!I30)),\"X\",\"\")","v":""},{"$f":"IF(ISNUMBER(SEARCH(\"Laboratory evaluations\",'Data extraction-synthesis'!I30)),\"X\",\"\")","v":""},{"$f":"IF(ISNUMBER(SEARCH(\"Models\",'Data extraction-synthesis'!I30)),\"X\",\"\")","v":""},{"$f":"IF(ISNUMBER(SEARCH(\"Early usability studies\",'Data extraction-synthesis'!I30)),\"X\",\"\")","v":""},{"$f":"IF(ISNUMBER(SEARCH(\"No input sources reported\",'Data extraction-synthesis'!I30)),\"X\",\"\")","v":"X"},"N/A"]
["UNICEF","Zika Virus Diagnostics: Target Product Profiles & Supply Update",{"$f":"IF(ISNUMBER(SEARCH(\"Literature\",'Data extraction-synthesis'!I31)),\"X\",\"\")","v":"X"},{"$f":"IF(ISNUMBER(SEARCH(\"Industry standard\",'Data extraction-synthesis'!I31)),\"X\",\"\")","v":""},{"$f":"IF(ISNUMBER(SEARCH(\"Guidelines\",'Data extraction-synthesis'!I31)),\"X\",\"\")","v":""},{"$f":"IF(ISNUMBER(SEARCH(\"Consensus meeting inputs\",'Data extraction-synthesis'!I31)),\"X\",\"\")","v":""},"X",{"$f":"IF(ISNUMBER(SEARCH(\"Meeting input\",'Data extraction-synthesis'!I31)),\"X\",\"\")","v":""},{"$f":"IF(ISNUMBER(SEARCH(\"Available data\",'Data extraction-synthesis'!I31)),\"X\",\"\")","v":""},{"$f":"IF(ISNUMBER(SEARCH(\"Field observations\",'Data extraction-synthesis'!I31)),\"X\",\"\")","v":""},{"$f":"IF(ISNUMBER(SEARCH(\"Laboratory evaluations\",'Data extraction-synthesis'!I31)),\"X\",\"\")","v":""},{"$f":"IF(ISNUMBER(SEARCH(\"Models\",'Data extraction-synthesis'!I31)),\"X\",\"\")","v":""},{"$f":"IF(ISNUMBER(SEARCH(\"Early usability studies\",'Data extraction-synthesis'!I31)),\"X\",\"\")","v":""},{"$f":"IF(ISNUMBER(SEARCH(\"No input sources reported\",'Data extraction-synthesis'!I31)),\"X\",\"\")","v":""},"YES",{"$nulls":4},"No, literature cited in the main text alongside the table"]
["UNICEF","Pneumonia Acute Respiratory Infection Diagnostic Aid-Target Product Profile Introduction",{"$f":"IF(ISNUMBER(SEARCH(\"Literature\",'Data extraction-synthesis'!I32)),\"X\",\"\")","v":"X"},{"$f":"IF(ISNUMBER(SEARCH(\"Industry standard\",'Data extraction-synthesis'!I32)),\"X\",\"\")","v":""},{"$f":"IF(ISNUMBER(SEARCH(\"Guidelines\",'Data extraction-synthesis'!I32)),\"X\",\"\")","v":""},{"$f":"IF(ISNUMBER(SEARCH(\"Consensus meeting inputs\",'Data extraction-synthesis'!I32)),\"X\",\"\")","v":""},"X",{"$f":"IF(ISNUMBER(SEARCH(\"Meeting input\",'Data extraction-synthesis'!I32)),\"X\",\"\")","v":""},{"$f":"IF(ISNUMBER(SEARCH(\"Available data\",'Data extraction-synthesis'!I32)),\"X\",\"\")","v":""},{"$f":"IF(ISNUMBER(SEARCH(\"Field observations\",'Data extraction-synthesis'!I32)),\"X\",\"\")","v":""},{"$f":"IF(ISNUMBER(SEARCH(\"Laboratory evaluations\",'Data extraction-synthesis'!I32)),\"X\",\"\")","v":""},{"$f":"IF(ISNUMBER(SEARCH(\"Models\",'Data extraction-synthesis'!I32)),\"X\",\"\")","v":""},{"$f":"IF(ISNUMBER(SEARCH(\"Early usability studies\",'Data extraction-synthesis'!I32)),\"X\",\"\")","v":""},{"$f":"IF(ISNUMBER(SEARCH(\"No input sources reported\",'Data extraction-synthesis'!I32)),\"X\",\"\")","v":""},"YES",{"$nulls":4},"No, they mentioned that the TPP was informed with a literature review."]
["Pal S, Jasper L.E., Lawrence K.L, Walter M","Assessing the Dengue Diagnosis Capability Gap in the Military Health System",{"$f":"IF(ISNUMBER(SEARCH(\"Literature\",'Data extraction-synthesis'!I33)),\"X\",\"\")","v":""},{"$f":"IF(ISNUMBER(SEARCH(\"Industry standard\",'Data extraction-synthesis'!I33)),\"X\",\"\")","v":""},{"$f":"IF(ISNUMBER(SEARCH(\"Guidelines\",'Data extraction-synthesis'!I33)),\"X\",\"\")","v":""},{"$f":"IF(ISNUMBER(SEARCH(\"Consensus meeting inputs\",'Data extraction-synthesis'!I33)),\"X\",\"\")","v":""},"X",{"$f":"IF(ISNUMBER(SEARCH(\"Meeting input\",'Data extraction-synthesis'!I33)),\"X\",\"\")","v":""},{"$f":"IF(ISNUMBER(SEARCH(\"Available data\",'Data extraction-synthesis'!I33)),\"X\",\"\")","v":""},{"$f":"IF(ISNUMBER(SEARCH(\"Field observations\",'Data extraction-synthesis'!I33)),\"X\",\"\")","v":""},{"$f":"IF(ISNUMBER(SEARCH(\"Laboratory evaluations\",'Data extraction-synthesis'!I33)),\"X\",\"\")","v":""},{"$f":"IF(ISNUMBER(SEARCH(\"Models\",'Data extraction-synthesis'!I33)),\"X\",\"\")","v":"X"},{"$f":"IF(ISNUMBER(SEARCH(\"Early usability studies\",'Data extraction-synthesis'!I33)),\"X\",\"\")","v":""},{"$f":"IF(ISNUMBER(SEARCH(\"No input sources reported\",'Data extraction-synthesis'!I33)),\"X\",\"\")","v":""},"YES",{"$nulls":5},"Surveys with experts"]
["PATH","Target Product Profile: Schistosomiasis Surveillance Diagnostic Lateral Flow Test CAA antigen",{"$f":"IF(ISNUMBER(SEARCH(\"Literature\",'Data extraction-synthesis'!I34)),\"X\",\"\")","v":"X"},{"$f":"IF(ISNUMBER(SEARCH(\"Industry standard\",'Data extraction-synthesis'!I34)),\"X\",\"\")","v":""},{"$f":"IF(ISNUMBER(SEARCH(\"Guidelines\",'Data extraction-synthesis'!I34)),\"X\",\"\")","v":"X"},{"$f":"IF(ISNUMBER(SEARCH(\"Consensus meeting inputs\",'Data extraction-synthesis'!I34)),\"X\",\"\")","v":""},"X",{"$f":"IF(ISNUMBER(SEARCH(\"Meeting input\",'Data extraction-synthesis'!I34)),\"X\",\"\")","v":""},{"$f":"IF(ISNUMBER(SEARCH(\"Available data\",'Data extraction-synthesis'!I34)),\"X\",\"\")","v":"X"},{"$f":"IF(ISNUMBER(SEARCH(\"Field observations\",'Data extraction-synthesis'!I34)),\"X\",\"\")","v":"X"},{"$f":"IF(ISNUMBER(SEARCH(\"Laboratory evaluations\",'Data extraction-synthesis'!I34)),\"X\",\"\")","v":""},{"$f":"IF(ISNUMBER(SEARCH(\"Models\",'Data extraction-synthesis'!I34)),\"X\",\"\")","v":""},{"$f":"IF(ISNUMBER(SEARCH(\"Early usability studies\",'Data extraction-synthesis'!I34)),\"X\",\"\")","v":""},{"$f":"IF(ISNUMBER(SEARCH(\"No input sources reported\",'Data extraction-synthesis'!I34)),\"X\",\"\")","v":""},"YES",{"$nulls":4},"No, literature cited in the main text for some test characteristics"]
["PATH","Target Product Profile: Trachoma Surveillance Diagnostic-Post-Elimination Surveillance Antibody Lateral Flow Test",{"$f":"IF(ISNUMBER(SEARCH(\"Literature\",'Data extraction-synthesis'!I35)),\"X\",\"\")","v":"X"},{"$f":"IF(ISNUMBER(SEARCH(\"Industry standard\",'Data extraction-synthesis'!I35)),\"X\",\"\")","v":""},{"$f":"IF(ISNUMBER(SEARCH(\"Guidelines\",'Data extraction-synthesis'!I35)),\"X\",\"\")","v":"X"},{"$f":"IF(ISNUMBER(SEARCH(\"Consensus meeting inputs\",'Data extraction-synthesis'!I35)),\"X\",\"\")","v":""},"X",{"$f":"IF(ISNUMBER(SEARCH(\"Meeting input\",'Data extraction-synthesis'!I35)),\"X\",\"\")","v":""},{"$f":"IF(ISNUMBER(SEARCH(\"Available data\",'Data extraction-synthesis'!I35)),\"X\",\"\")","v":"X"},{"$f":"IF(ISNUMBER(SEARCH(\"Field observations\",'Data extraction-synthesis'!I35)),\"X\",\"\")","v":""},{"$f":"IF(ISNUMBER(SEARCH(\"Laboratory evaluations\",'Data extraction-synthesis'!I35)),\"X\",\"\")","v":""},{"$f":"IF(ISNUMBER(SEARCH(\"Models\",'Data extraction-synthesis'!I35)),\"X\",\"\")","v":""},{"$f":"IF(ISNUMBER(SEARCH(\"Early usability studies\",'Data extraction-synthesis'!I35)),\"X\",\"\")","v":""},{"$f":"IF(ISNUMBER(SEARCH(\"No input sources reported\",'Data extraction-synthesis'!I35)),\"X\",\"\")","v":""},"YES",{"$nulls":4},"No, literature cited in the main text for some test characteristics"]
["International Diagnostics Centre (IDC)","Target Product Profile (TPP) - Point-of-Care HIV Viral Load Test",{"$f":"IF(ISNUMBER(SEARCH(\"Literature\",'Data extraction-synthesis'!I36)),\"X\",\"\")","v":""},{"$f":"IF(ISNUMBER(SEARCH(\"Industry standard\",'Data extraction-synthesis'!I36)),\"X\",\"\")","v":""},{"$f":"IF(ISNUMBER(SEARCH(\"Guidelines\",'Data extraction-synthesis'!I36)),\"X\",\"\")","v":""},{"$f":"IF(ISNUMBER(SEARCH(\"Consensus meeting inputs\",'Data extraction-synthesis'!I36)),\"X\",\"\")","v":""},"",{"$f":"IF(ISNUMBER(SEARCH(\"Meeting input\",'Data extraction-synthesis'!I36)),\"X\",\"\")","v":""},{"$f":"IF(ISNUMBER(SEARCH(\"Available data\",'Data extraction-synthesis'!I36)),\"X\",\"\")","v":""},{"$f":"IF(ISNUMBER(SEARCH(\"Field observations\",'Data extraction-synthesis'!I36)),\"X\",\"\")","v":""},{"$f":"IF(ISNUMBER(SEARCH(\"Laboratory evaluations\",'Data extraction-synthesis'!I36)),\"X\",\"\")","v":""},{"$f":"IF(ISNUMBER(SEARCH(\"Models\",'Data extraction-synthesis'!I36)),\"X\",\"\")","v":""},{"$f":"IF(ISNUMBER(SEARCH(\"Early usability studies\",'Data extraction-synthesis'!I36)),\"X\",\"\")","v":""},{"$f":"IF(ISNUMBER(SEARCH(\"No input sources reported\",'Data extraction-synthesis'!I36)),\"X\",\"\")","v":"X"},"N/A"]
["International Diagnostics Centre (IDC)","Target Product Profile (TPP)- Point of care CD4 test",{"$f":"IF(ISNUMBER(SEARCH(\"Literature\",'Data extraction-synthesis'!I37)),\"X\",\"\")","v":""},{"$f":"IF(ISNUMBER(SEARCH(\"Industry standard\",'Data extraction-synthesis'!I37)),\"X\",\"\")","v":""},{"$f":"IF(ISNUMBER(SEARCH(\"Guidelines\",'Data extraction-synthesis'!I37)),\"X\",\"\")","v":""},{"$f":"IF(ISNUMBER(SEARCH(\"Consensus meeting inputs\",'Data extraction-synthesis'!I37)),\"X\",\"\")","v":""},"",{"$f":"IF(ISNUMBER(SEARCH(\"Meeting input\",'Data extraction-synthesis'!I37)),\"X\",\"\")","v":""},{"$f":"IF(ISNUMBER(SEARCH(\"Available data\",'Data extraction-synthesis'!I37)),\"X\",\"\")","v":""},{"$f":"IF(ISNUMBER(SEARCH(\"Field observations\",'Data extraction-synthesis'!I37)),\"X\",\"\")","v":""},{"$f":"IF(ISNUMBER(SEARCH(\"Laboratory evaluations\",'Data extraction-synthesis'!I37)),\"X\",\"\")","v":""},{"$f":"IF(ISNUMBER(SEARCH(\"Models\",'Data extraction-synthesis'!I37)),\"X\",\"\")","v":""},{"$f":"IF(ISNUMBER(SEARCH(\"Early usability studies\",'Data extraction-synthesis'!I37)),\"X\",\"\")","v":""},{"$f":"IF(ISNUMBER(SEARCH(\"No input sources reported\",'Data extraction-synthesis'!I37)),\"X\",\"\")","v":"X"},"N/A"]
["International Diagnostics Centre (IDC)","Target Product Profile (TPP): Point of care EID test",{"$f":"IF(ISNUMBER(SEARCH(\"Literature\",'Data extraction-synthesis'!I38)),\"X\",\"\")","v":""},{"$f":"IF(ISNUMBER(SEARCH(\"Industry standard\",'Data extraction-synthesis'!I38)),\"X\",\"\")","v":""},{"$f":"IF(ISNUMBER(SEARCH(\"Guidelines\",'Data extraction-synthesis'!I38)),\"X\",\"\")","v":""},{"$f":"IF(ISNUMBER(SEARCH(\"Consensus meeting inputs\",'Data extraction-synthesis'!I38)),\"X\",\"\")","v":""},"",{"$f":"IF(ISNUMBER(SEARCH(\"Meeting input\",'Data extraction-synthesis'!I38)),\"X\",\"\")","v":""},{"$f":"IF(ISNUMBER(SEARCH(\"Available data\",'Data extraction-synthesis'!I38)),\"X\",\"\")","v":""},{"$f":"IF(ISNUMBER(SEARCH(\"Field observations\",'Data extraction-synthesis'!I38)),\"X\",\"\")","v":""},{"$f":"IF(ISNUMBER(SEARCH(\"Laboratory evaluations\",'Data extraction-synthesis'!I38)),\"X\",\"\")","v":""},{"$f":"IF(ISNUMBER(SEARCH(\"Models\",'Data extraction-synthesis'!I38)),\"X\",\"\")","v":""},{"$f":"IF(ISNUMBER(SEARCH(\"Early usability studies\",'Data extraction-synthesis'!I38)),\"X\",\"\")","v":""},{"$f":"IF(ISNUMBER(SEARCH(\"No input sources reported\",'Data extraction-synthesis'!I38)),\"X\",\"\")","v":"X"},"N/A"]
["Internationa Diagnostics Centre (IDC)","Target Product Profile (TPP): Combined HIV/Syphilis Test",{"$f":"IF(ISNUMBER(SEARCH(\"Literature\",'Data extraction-synthesis'!I39)),\"X\",\"\")","v":""},{"$f":"IF(ISNUMBER(SEARCH(\"Industry standard\",'Data extraction-synthesis'!I39)),\"X\",\"\")","v":""},{"$f":"IF(ISNUMBER(SEARCH(\"Guidelines\",'Data extraction-synthesis'!I39)),\"X\",\"\")","v":""},{"$f":"IF(ISNUMBER(SEARCH(\"Consensus meeting inputs\",'Data extraction-synthesis'!I39)),\"X\",\"\")","v":""},"",{"$f":"IF(ISNUMBER(SEARCH(\"Meeting input\",'Data extraction-synthesis'!I39)),\"X\",\"\")","v":""},{"$f":"IF(ISNUMBER(SEARCH(\"Available data\",'Data extraction-synthesis'!I39)),\"X\",\"\")","v":""},{"$f":"IF(ISNUMBER(SEARCH(\"Field observations\",'Data extraction-synthesis'!I39)),\"X\",\"\")","v":""},{"$f":"IF(ISNUMBER(SEARCH(\"Laboratory evaluations\",'Data extraction-synthesis'!I39)),\"X\",\"\")","v":""},{"$f":"IF(ISNUMBER(SEARCH(\"Models\",'Data extraction-synthesis'!I39)),\"X\",\"\")","v":""},{"$f":"IF(ISNUMBER(SEARCH(\"Early usability studies\",'Data extraction-synthesis'!I39)),\"X\",\"\")","v":""},{"$f":"IF(ISNUMBER(SEARCH(\"No input sources reported\",'Data extraction-synthesis'!I39)),\"X\",\"\")","v":"X"},"N/A"]
["Ebels, K. B. C., C.: Crudder, C. H.: McGray, S.: Magnuson, K.: Tietje, K.: Labarre, P","Incorporating user needs into product development for improved infection detection for malaria elimination programs",{"$f":"IF(ISNUMBER(SEARCH(\"Literature\",'Data extraction-synthesis'!I40)),\"X\",\"\")","v":""},{"$f":"IF(ISNUMBER(SEARCH(\"Industry standard\",'Data extraction-synthesis'!I40)),\"X\",\"\")","v":""},{"$f":"IF(ISNUMBER(SEARCH(\"Guidelines\",'Data extraction-synthesis'!I40)),\"X\",\"\")","v":""},{"$f":"IF(ISNUMBER(SEARCH(\"Consensus meeting inputs\",'Data extraction-synthesis'!I40)),\"X\",\"\")","v":""},null,{"$f":"IF(ISNUMBER(SEARCH(\"Meeting input\",'Data extraction-synthesis'!I40)),\"X\",\"\")","v":""},{"$f":"IF(ISNUMBER(SEARCH(\"Available data\",'Data extraction-synthesis'!I40)),\"X\",\"\")","v":""},{"$f":"IF(ISNUMBER(SEARCH(\"Field observations\",'Data extraction-synthesis'!I40)),\"X\",\"\")","v":"X"},{"$f":"IF(ISNUMBER(SEARCH(\"Laboratory evaluations\",'Data extraction-synthesis'!I40)),\"X\",\"\")","v":""},{"$f":"IF(ISNUMBER(SEARCH(\"Models\",'Data extraction-synthesis'!I40)),\"X\",\"\")","v":""},{"$f":"IF(ISNUMBER(SEARCH(\"Early usability studies\",'Data extraction-synthesis'!I40)),\"X\",\"\")","v":""},{"$f":"IF(ISNUMBER(SEARCH(\"No input sources reported\",'Data extraction-synthesis'!I40)),\"X\",\"\")","v":""},"NO"]
["FIND","Target Product Profile: Screening test for human African trypanosomiasis (HAT)",{"$f":"IF(ISNUMBER(SEARCH(\"Literature\",'Data extraction-synthesis'!I41)),\"X\",\"\")","v":""},{"$f":"IF(ISNUMBER(SEARCH(\"Industry standard\",'Data extraction-synthesis'!I41)),\"X\",\"\")","v":""},{"$f":"IF(ISNUMBER(SEARCH(\"Guidelines\",'Data extraction-synthesis'!I41)),\"X\",\"\")","v":""},{"$f":"IF(ISNUMBER(SEARCH(\"Consensus meeting inputs\",'Data extraction-synthesis'!I41)),\"X\",\"\")","v":""},"",{"$f":"IF(ISNUMBER(SEARCH(\"Meeting input\",'Data extraction-synthesis'!I41)),\"X\",\"\")","v":""},{"$f":"IF(ISNUMBER(SEARCH(\"Available data\",'Data extraction-synthesis'!I41)),\"X\",\"\")","v":""},{"$f":"IF(ISNUMBER(SEARCH(\"Field observations\",'Data extraction-synthesis'!I41)),\"X\",\"\")","v":""},{"$f":"IF(ISNUMBER(SEARCH(\"Laboratory evaluations\",'Data extraction-synthesis'!I41)),\"X\",\"\")","v":""},{"$f":"IF(ISNUMBER(SEARCH(\"Models\",'Data extraction-synthesis'!I41)),\"X\",\"\")","v":""},{"$f":"IF(ISNUMBER(SEARCH(\"Early usability studies\",'Data extraction-synthesis'!I41)),\"X\",\"\")","v":""},{"$f":"IF(ISNUMBER(SEARCH(\"No input sources reported\",'Data extraction-synthesis'!I41)),\"X\",\"\")","v":"X"},"N/A"]
["PATH","Target Product Profile: Trachoma surveillance diagnostic-antigen lateral flow test",{"$f":"IF(ISNUMBER(SEARCH(\"Literature\",'Data extraction-synthesis'!I42)),\"X\",\"\")","v":"X"},{"$f":"IF(ISNUMBER(SEARCH(\"Industry standard\",'Data extraction-synthesis'!I42)),\"X\",\"\")","v":""},{"$f":"IF(ISNUMBER(SEARCH(\"Guidelines\",'Data extraction-synthesis'!I42)),\"X\",\"\")","v":"X"},{"$f":"IF(ISNUMBER(SEARCH(\"Consensus meeting inputs\",'Data extraction-synthesis'!I42)),\"X\",\"\")","v":""},"X",{"$f":"IF(ISNUMBER(SEARCH(\"Meeting input\",'Data extraction-synthesis'!I42)),\"X\",\"\")","v":""},{"$f":"IF(ISNUMBER(SEARCH(\"Available data\",'Data extraction-synthesis'!I42)),\"X\",\"\")","v":"X"},{"$f":"IF(ISNUMBER(SEARCH(\"Field observations\",'Data extraction-synthesis'!I42)),\"X\",\"\")","v":""},{"$f":"IF(ISNUMBER(SEARCH(\"Laboratory evaluations\",'Data extraction-synthesis'!I42)),\"X\",\"\")","v":""},{"$f":"IF(ISNUMBER(SEARCH(\"Models\",'Data extraction-synthesis'!I42)),\"X\",\"\")","v":""},{"$f":"IF(ISNUMBER(SEARCH(\"Early usability studies\",'Data extraction-synthesis'!I42)),\"X\",\"\")","v":""},{"$f":"IF(ISNUMBER(SEARCH(\"No input sources reported\",'Data extraction-synthesis'!I42)),\"X\",\"\")","v":""},"YES",{"$nulls":4},"No, literature cited in the main text for some test characteristics"]
["Peck, R. B. W., J. D.: Boettcher, M. G.: Downing","Defining product requirements for field deployable yellow fever tests",{"$f":"IF(ISNUMBER(SEARCH(\"Literature\",'Data extraction-synthesis'!I43)),\"X\",\"\")","v":""},{"$f":"IF(ISNUMBER(SEARCH(\"Industry standard\",'Data extraction-synthesis'!I43)),\"X\",\"\")","v":""},{"$f":"IF(ISNUMBER(SEARCH(\"Guidelines\",'Data extraction-synthesis'!I43)),\"X\",\"\")","v":""},{"$f":"IF(ISNUMBER(SEARCH(\"Consensus meeting inputs\",'Data extraction-synthesis'!I43)),\"X\",\"\")","v":""},null,{"$f":"IF(ISNUMBER(SEARCH(\"Meeting input\",'Data extraction-synthesis'!I43)),\"X\",\"\")","v":""},{"$f":"IF(ISNUMBER(SEARCH(\"Available data\",'Data extraction-synthesis'!I43)),\"X\",\"\")","v":""},{"$f":"IF(ISNUMBER(SEARCH(\"Field observations\",'Data extraction-synthesis'!I43)),\"X\",\"\")","v":""},{"$f":"IF(ISNUMBER(SEARCH(\"Laboratory evaluations\",'Data extraction-synthesis'!I43)),\"X\",\"\")","v":""},{"$f":"IF(ISNUMBER(SEARCH(\"Models\",'Data extraction-synthesis'!I43)),\"X\",\"\")","v":""},{"$f":"IF(ISNUMBER(SEARCH(\"Early usability studies\",'Data extraction-synthesis'!I43)),\"X\",\"\")","v":""},{"$f":"IF(ISNUMBER(SEARCH(\"No input sources reported\",'Data extraction-synthesis'!I43)),\"X\",\"\")","v":""},"NO",{"$nulls":5},"Interviews with experts"]
["PATH","Target Product Profile: Schistosomiasis Surveillance Diagnostic - schistosoma genus-specific antibody lateral flow test post-elimination surveillance",{"$f":"IF(ISNUMBER(SEARCH(\"Literature\",'Data extraction-synthesis'!I44)),\"X\",\"\")","v":"X"},{"$f":"IF(ISNUMBER(SEARCH(\"Industry standard\",'Data extraction-synthesis'!I44)),\"X\",\"\")","v":""},{"$f":"IF(ISNUMBER(SEARCH(\"Guidelines\",'Data extraction-synthesis'!I44)),\"X\",\"\")","v":"X"},{"$f":"IF(ISNUMBER(SEARCH(\"Consensus meeting inputs\",'Data extraction-synthesis'!I44)),\"X\",\"\")","v":""},"X",{"$f":"IF(ISNUMBER(SEARCH(\"Meeting input\",'Data extraction-synthesis'!I44)),\"X\",\"\")","v":""},{"$f":"IF(ISNUMBER(SEARCH(\"Available data\",'Data extraction-synthesis'!I44)),\"X\",\"\")","v":"X"},{"$f":"IF(ISNUMBER(SEARCH(\"Field observations\",'Data extraction-synthesis'!I44)),\"X\",\"\")","v":"X"},{"$f":"IF(ISNUMBER(SEARCH(\"Laboratory evaluations\",'Data extraction-synthesis'!I44)),\"X\",\"\")","v":""},{"$f":"IF(ISNUMBER(SEARCH(\"Models\",'Data extraction-synthesis'!I44)),\"X\",\"\")","v":""},{"$f":"IF(ISNUMBER(SEARCH(\"Early usability studies\",'Data extraction-synthesis'!I44)),\"X\",\"\")","v":""},{"$f":"IF(ISNUMBER(SEARCH(\"No input sources reported\",'Data extraction-synthesis'!I44)),\"X\",\"\")","v":""},"YES",{"$nulls":4},"No, literature cited in the main text for some test characteristics"]
["WHO, FIND, Medecins sans Frontiers","A Multiplex Multi-Analyte Diagnostic Platform",{"$f":"IF(ISNUMBER(SEARCH(\"Literature\",'Data extraction-synthesis'!I45)),\"X\",\"\")","v":""},{"$f":"IF(ISNUMBER(SEARCH(\"Industry standard\",'Data extraction-synthesis'!I45)),\"X\",\"\")","v":""},{"$f":"IF(ISNUMBER(SEARCH(\"Guidelines\",'Data extraction-synthesis'!I45)),\"X\",\"\")","v":""},{"$f":"IF(ISNUMBER(SEARCH(\"Consensus meeting inputs\",'Data extraction-synthesis'!I45)),\"X\",\"\")","v":""},"X",{"$f":"IF(ISNUMBER(SEARCH(\"Meeting input\",'Data extraction-synthesis'!I45)),\"X\",\"\")","v":""},{"$f":"IF(ISNUMBER(SEARCH(\"Available data\",'Data extraction-synthesis'!I45)),\"X\",\"\")","v":""},{"$f":"IF(ISNUMBER(SEARCH(\"Field observations\",'Data extraction-synthesis'!I45)),\"X\",\"\")","v":""},{"$f":"IF(ISNUMBER(SEARCH(\"Laboratory evaluations\",'Data extraction-synthesis'!I45)),\"X\",\"\")","v":""},{"$f":"IF(ISNUMBER(SEARCH(\"Models\",'Data extraction-synthesis'!I45)),\"X\",\"\")","v":""},{"$f":"IF(ISNUMBER(SEARCH(\"Early usability studies\",'Data extraction-synthesis'!I45)),\"X\",\"\")","v":""},{"$f":"IF(ISNUMBER(SEARCH(\"No input sources reported\",'Data extraction-synthesis'!I45)),\"X\",\"\")","v":""},"NO"]
[null,"TOT",{"$f":"COUNTIF(C3:C46,\"X\")","v":22},{"$f":"COUNTIF(D3:D46,\"X\")","v":1},6,3,24,8,7,5,1,9,1,11]
[null,null,{"$f":"C47/33","v":{"v":0.6666666666666666,"d":"67%"}},{"v":0.030303030303030304,"d":"3%"},{"v":0.18181818181818182,"d":"18%"},{"v":0.09090909090909091,"d":"9%"},{"v":0.7272727272727273,"d":"73%"},{"v":0.24242424242424243,"d":"24%"},{"v":0.21212121212121213,"d":"21%"},{"v":0.15151515151515152,"d":"15%"},{"v":0.030303030303030304,"d":"3%"},{"v":0.2727272727272727,"d":"27%"},{"v":0.030303030303030304,"d":"3%"},{"v":0.3333333333333333,"d":"33%"}]

{"sheet":"Input source analytic accuracy","index":3,"n_rows":48,"n_cols":18,"rows_kept":48,"merged":[[0,2,0,14]]}
[null,null,"Input source to populate analytical accuracy"]
["Authors","Article title","Literature","Industry standard","Guidelines","Interviews with experts","Surveys with experts/expert opinion","Consensus meeting inputs","Available data","Field observations","Laboratory evaluations","Models ","Early usability studies ","No input sources reported","N/A (no reference to specific literature)","More than 1 input source?","% STUDIES WITH 1 INPUT SOURCE","% STUDIES WITH >1 INPUT SOURCE"]
["Chua, A. P., I.: Nuebling, C. M.: Wood, D.: Moussy, F.","Update on Zika Diagnostic Tests and WHO's Related Activities",{"$f":"IF(ISNUMBER(SEARCH(\"Literature\",'Data extraction-synthesis'!J2)),\"X\",\"\")","v":""},{"$f":"IF(ISNUMBER(SEARCH(\"Industry standard\",'Data extraction-synthesis'!J2)),\"X\",\"\")","v":""},{"$f":"IF(ISNUMBER(SEARCH(\"Guidelines\",'Data extraction-synthesis'!J2)),\"X\",\"\")","v":""},{"$f":"IF(ISNUMBER(SEARCH(\"Interviews with experts\",'Data extraction-synthesis'!J2)),\"X\",\"\")","v":""},{"$f":"IF(ISNUMBER(SEARCH(\"Surveys with experts/expert opinion\",'Data extraction-synthesis'!J2)),\"X\",\"\")","v":""},{"$f":"IF(ISNUMBER(SEARCH(\"Consensus meeting inputs\",'Data extraction-synthesis'!J2)),\"X\",\"\")","v":""},{"$f":"IF(ISNUMBER(SEARCH(\"Available data\",'Data extraction-synthesis'!J2)),\"X\",\"\")","v":""},{"$f":"IF(ISNUMBER(SEARCH(\"Field observations\",'Data extraction-synthesis'!J2)),\"X\",\"\")","v":""},{"$f":"IF(ISNUMBER(SEARCH(\"Laboratory evaluations\",'Data extraction-synthesis'!J2)),\"X\",\"\")","v":""},{"$f":"IF(ISNUMBER(SEARCH(\"Models\",'Data extraction-synthesis'!J2)),\"X\",\"\")","v":""},{"$f":"IF(ISNUMBER(SEARCH(\"Early usability studies\",'Data extraction-synthesis'!J2)),\"X\",\"\")","v":""},{"$f":"IF(ISNUMBER(SEARCH(\"No input sources reported\",'Data extraction-synthesis'!J2)),\"X\",\"\")","v":"X"},{"$f":"IF(ISNUMBER(SEARCH(\"N/A\",'Data extraction-synthesis'!J2)),\"X\",\"\")","v":""},{"$f":"IF(OR(O3=\"X\",N3=\"X\"),\"N/A\",IF((COUNTIF(C3:O3,\"X\"))>1,\"YES\",\"NO\"))","v":"N/A"},{"$f":"COUNTIF(P3:P46,\"NO\")/44","v":{"v":0.22727272727272727,"d":"23%"}},{"$f":"COUNTIF(P3:P46,\"YES\")/44","v":{"v":0.1590909090909091,"d":"16%"}}]
["Denkinger, C. M. D., D.: Schito, M.: Wells, W.: Cobelens, F.: Pai, M.: Zignol, M.: Cirillo, D. M.: Alland, D.: Casenghi, M.: Gallarda, J.: Boehme, C. C.: Perkins, M. D","Target Product Profile of a Molecular Drug-Susceptibility Test for Use in Microscopy Centers",null,{"$f":"IF(ISNUMBER(SEARCH(\"Industry standard\",'Data extraction-synthesis'!J3)),\"X\",\"\")","v":""},{"$f":"IF(ISNUMBER(SEARCH(\"Guidelines\",'Data extraction-synthesis'!J3)),\"X\",\"\")","v":""},{"$f":"IF(ISNUMBER(SEARCH(\"Interviews with experts\",'Data extraction-synthesis'!J3)),\"X\",\"\")","v":""},{"$f":"IF(ISNUMBER(SEARCH(\"Surveys with experts/expert opinion\",'Data extraction-synthesis'!J3)),\"X\",\"\")","v":""},{"$f":"IF(ISNUMBER(SEARCH(\"Consensus meeting inputs\",'Data extraction-synthesis'!J3)),\"X\",\"\")","v":""},{"$f":"IF(ISNUMBER(SEARCH(\"Available data\",'Data extraction-synthesis'!J3)),\"X\",\"\")","v":""},{"$f":"IF(ISNUMBER(SEARCH(\"Field observations\",'Data extraction-synthesis'!J3)),\"X\",\"\")","v":""},{"$f":"IF(ISNUMBER(SEARCH(\"Laboratory evaluations\",'Data extraction-synthesis'!J3)),\"X\",\"\")","v":""},null,{"$f":"IF(ISNUMBER(SEARCH(\"Early usability studies\",'Data extraction-synthesis'!J3)),\"X\",\"\")","v":""},"x",{"$f":"IF(ISNUMBER(SEARCH(\"N/A\",'Data extraction-synthesis'!J3)),\"X\",\"\")","v":""},"N/A"]
["Denkinger, C. M. K., Sandra V.: Cirillo, Daniela Maria: Casenghi, Martina: Shinnick, Thomas: Weyer, Karin: Gilpin, Chris: Boehme, Catharina C.: Schito, Marco: Kimerling, Michael: Pai, Madhuka","Defining the needs for next generation assays for tuberculosis",null,{"$f":"IF(ISNUMBER(SEARCH(\"Industry standard\",'Data extraction-synthesis'!J4)),\"X\",\"\")","v":""},{"$f":"IF(ISNUMBER(SEARCH(\"Guidelines\",'Data extraction-synthesis'!J4)),\"X\",\"\")","v":""},{"$f":"IF(ISNUMBER(SEARCH(\"Interviews with experts\",'Data extraction-synthesis'!J4)),\"X\",\"\")","v":""},{"$f":"IF(ISNUMBER(SEARCH(\"Surveys with experts/expert opinion\",'Data extraction-synthesis'!J4)),\"X\",\"\")","v":""},{"$f":"IF(ISNUMBER(SEARCH(\"Consensus meeting inputs\",'Data extraction-synthesis'!J4)),\"X\",\"\")","v":""},{"$f":"IF(ISNUMBER(SEARCH(\"Available data\",'Data extraction-synthesis'!J4)),\"X\",\"\")","v":""},{"$f":"IF(ISNUMBER(SEARCH(\"Field observations\",'Data extraction-synthesis'!J4)),\"X\",\"\")","v":""},{"$f":"IF(ISNUMBER(SEARCH(\"Laboratory evaluations\",'Data extraction-synthesis'!J4)),\"X\",\"\")","v":""},null,{"$f":"IF(ISNUMBER(SEARCH(\"Early usability studies\",'Data extraction-synthesis'!J4)),\"X\",\"\")","v":""},{"$f":"IF(ISNUMBER(SEARCH(\"No input sources reported\",'Data extraction-synthesis'!J4)),\"X\",\"\")","v":""},{"$f":"IF(ISNUMBER(SEARCH(\"N/A\",'Data extraction-synthesis'!J4)),\"X\",\"\")","v":""},"NO"]
["DIAMETER Project, PATH","Point-of-Care Malaria Infection Detection Test For rapid detection of low-density, subclinical malaria infections",{"$f":"IF(ISNUMBER(SEARCH(\"Literature\",'Data extraction-synthesis'!J5)),\"X\",\"\")","v":"X"},{"$f":"IF(ISNUMBER(SEARCH(\"Industry standard\",'Data extraction-synthesis'!J5)),\"X\",\"\")","v":""},{"$f":"IF(ISNUMBER(SEARCH(\"Guidelines\",'Data extraction-synthesis'!J5)),\"X\",\"\")","v":""},{"$f":"IF(ISNUMBER(SEARCH(\"Interviews with experts\",'Data extraction-synthesis'!J5)),\"X\",\"\")","v":""},{"$f":"IF(ISNUMBER(SEARCH(\"Surveys with experts/expert opinion\",'Data extraction-synthesis'!J5)),\"X\",\"\")","v":"X"},{"$f":"IF(ISNUMBER(SEARCH(\"Consensus meeting inputs\",'Data extraction-synthesis'!J5)),\"X\",\"\")","v":""},{"$f":"IF(ISNUMBER(SEARCH(\"Available data\",'Data extraction-synthesis'!J5)),\"X\",\"\")","v":""},{"$f":"IF(ISNUMBER(SEARCH(\"Field observations\",'Data extraction-synthesis'!J5)),\"X\",\"\")","v":""},{"$f":"IF(ISNUMBER(SEARCH(\"Laboratory evaluations\",'Data extraction-synthesis'!J5)),\"X\",\"\")","v":""},{"$f":"IF(ISNUMBER(SEARCH(\"Models\",'Data extraction-synthesis'!J5)),\"X\",\"\")","v":""},{"$f":"IF(ISNUMBER(SEARCH(\"Early usability studies\",'Data extraction-synthesis'!J5)),\"X\",\"\")","v":""},{"$f":"IF(ISNUMBER(SEARCH(\"No input sources reported\",'Data extraction-synthesis'!J5)),\"X\",\"\")","v":""},{"$f":"IF(ISNUMBER(SEARCH(\"N/A\",'Data extraction-synthesis'!J5)),\"X\",\"\")","v":""},"YES"]
["Ding, X. C. A., Maria Paz: Baird, J. Kevin: Cheng, Qin: Cunningham, Jane: Dhorda, Mehul: Drakeley, Chris: Felger, Ingrid: Gamboa, Dionicia: Harbers, Matthias: Herrera, Socrates: Lucchi, Naomi: Mayor, Alfredo: Mueller, Ivo: Sattabongkot, Jetsumon: Ratsimbason, Arsène: Richards, Jack: Tanner, Marcel: González, Iveth J.","Defining the next generation of Plasmodium vivax diagnostic tests for control and elimination: Target product profiles","x",{"$f":"IF(ISNUMBER(SEARCH(\"Industry standard\",'Data extraction-synthesis'!J6)),\"X\",\"\")","v":""},{"$f":"IF(ISNUMBER(SEARCH(\"Guidelines\",'Data extraction-synthesis'!J6)),\"X\",\"\")","v":""},{"$f":"IF(ISNUMBER(SEARCH(\"Interviews with experts\",'Data extraction-synthesis'!J6)),\"X\",\"\")","v":""},{"$f":"IF(ISNUMBER(SEARCH(\"Surveys with experts/expert opinion\",'Data extraction-synthesis'!J6)),\"X\",\"\")","v":""},{"$f":"IF(ISNUMBER(SEARCH(\"Consensus meeting inputs\",'Data extraction-synthesis'!J6)),\"X\",\"\")","v":""},{"$f":"IF(ISNUMBER(SEARCH(\"Available data\",'Data extraction-synthesis'!J6)),\"X\",\"\")","v":""},{"$f":"IF(ISNUMBER(SEARCH(\"Field observations\",'Data extraction-synthesis'!J6)),\"X\",\"\")","v":""},{"$f":"IF(ISNUMBER(SEARCH(\"Laboratory evaluations\",'Data extraction-synthesis'!J6)),\"X\",\"\")","v":""},"x",{"$f":"IF(ISNUMBER(SEARCH(\"Early usability studies\",'Data extraction-synthesis'!J6)),\"X\",\"\")","v":""},{"$f":"IF(ISNUMBER(SEARCH(\"No input sources reported\",'Data extraction-synthesis'!J6)),\"X\",\"\")","v":""},{"$f":"IF(ISNUMBER(SEARCH(\"N/A\",'Data extraction-synthesis'!J6)),\"X\",\"\")","v":""},"YES"]
["Dittrich, S. T., B. T.: Moussy, F.: Chua, A.: Zorzet, A.: Tangden, T.: Dolinger, D. L.: Page, A. L.: Crump, J. A.: Valerie, D.: Bassat, Q.: Lubell, Y.: Heinrich, N.: Newton, P. N.: Rodwell, T.: Gonzalez, I. J.","Target Product Profile for a Diagnostic Assay to Differentiate between Bacterial and Non-Bacterial Infections to Guide Antimicrobials Use in Resource-Limited Settings: An Expert Consensus",{"$f":"IF(ISNUMBER(SEARCH(\"Literature\",'Data extraction-synthesis'!J7)),\"X\",\"\")","v":""},{"$f":"IF(ISNUMBER(SEARCH(\"Industry standard\",'Data extraction-synthesis'!J7)),\"X\",\"\")","v":""},{"$f":"IF(ISNUMBER(SEARCH(\"Guidelines\",'Data extraction-synthesis'!J7)),\"X\",\"\")","v":""},{"$f":"IF(ISNUMBER(SEARCH(\"Interviews with experts\",'Data extraction-synthesis'!J7)),\"X\",\"\")","v":""},{"$f":"IF(ISNUMBER(SEARCH(\"Surveys with experts/expert opinion\",'Data extraction-synthesis'!J7)),\"X\",\"\")","v":"X"},{"$f":"IF(ISNUMBER(SEARCH(\"Consensus meeting inputs\",'Data extraction-synthesis'!J7)),\"X\",\"\")","v":""},{"$f":"IF(ISNUMBER(SEARCH(\"Available data\",'Data extraction-synthesis'!J7)),\"X\",\"\")","v":""},{"$f":"IF(ISNUMBER(SEARCH(\"Field observations\",'Data extraction-synthesis'!J7)),\"X\",\"\")","v":""},{"$f":"IF(ISNUMBER(SEARCH(\"Laboratory evaluations\",'Data extraction-synthesis'!J7)),\"X\",\"\")","v":""},{"$f":"IF(ISNUMBER(SEARCH(\"Models\",'Data extraction-synthesis'!J7)),\"X\",\"\")","v":""},{"$f":"IF(ISNUMBER(SEARCH(\"Early usability studies\",'Data extraction-synthesis'!J7)),\"X\",\"\")","v":""},{"$f":"IF(ISNUMBER(SEARCH(\"No input sources reported\",'Data extraction-synthesis'!J7)),\"X\",\"\")","v":""},{"$f":"IF(ISNUMBER(SEARCH(\"N/A\",'Data extraction-synthesis'!J7)),\"X\",\"\")","v":""},"NO"]
["Donadeu, M. F., A. S.: Olliaro, P. L.: Abela-Ridder, B","Target product profiles for the diagnosis of Taenia solium taeniasis, neurocysticercosis and porcine cysticercosis",{"$f":"IF(ISNUMBER(SEARCH(\"Literature\",'Data extraction-synthesis'!J16)),\"X\",\"\")","v":"X"},{"$f":"IF(ISNUMBER(SEARCH(\"Industry standard\",'Data extraction-synthesis'!J16)),\"X\",\"\")","v":""},{"$f":"IF(ISNUMBER(SEARCH(\"Guidelines\",'Data extraction-synthesis'!J16)),\"X\",\"\")","v":""},{"$f":"IF(ISNUMBER(SEARCH(\"Interviews with experts\",'Data extraction-synthesis'!J16)),\"X\",\"\")","v":""},{"$f":"IF(ISNUMBER(SEARCH(\"Surveys with experts/expert opinion\",'Data extraction-synthesis'!J16)),\"X\",\"\")","v":"X"},{"$f":"IF(ISNUMBER(SEARCH(\"Consensus meeting inputs\",'Data extraction-synthesis'!J16)),\"X\",\"\")","v":""},{"$f":"IF(ISNUMBER(SEARCH(\"Available data\",'Data extraction-synthesis'!J16)),\"X\",\"\")","v":""},{"$f":"IF(ISNUMBER(SEARCH(\"Field observations\",'Data extraction-synthesis'!J16)),\"X\",\"\")","v":""},{"$f":"IF(ISNUMBER(SEARCH(\"Laboratory evaluations\",'Data extraction-synthesis'!J16)),\"X\",\"\")","v":""},{"$f":"IF(ISNUMBER(SEARCH(\"Models\",'Data extraction-synthesis'!J16)),\"X\",\"\")","v":""},{"$f":"IF(ISNUMBER(SEARCH(\"Early usability studies\",'Data extraction-synthesis'!J16)),\"X\",\"\")","v":""},{"$f":"IF(ISNUMBER(SEARCH(\"No input sources reported\",'Data extraction-synthesis'!J16)),\"X\",\"\")","v":""},{"$f":"IF(ISNUMBER(SEARCH(\"N/A\",'Data extraction-synthesis'!J16)),\"X\",\"\")","v":""},"YES"]
["Ebels, K. B. C., C.: Crudder, C. H.: McGray, S.: Magnuson, K.: Tietje, K.: Labarre, P","Incorporating user needs into product development for improved infection detection for malaria elimination programs",{"$f":"IF(ISNUMBER(SEARCH(\"Literature\",'Data extraction-synthesis'!J40)),\"X\",\"\")","v":""},{"$f":"IF(ISNUMBER(SEARCH(\"Industry standard\",'Data extraction-synthesis'!J40)),\"X\",\"\")","v":""},{"$f":"IF(ISNUMBER(SEARCH(\"Guidelines\",'Data extraction-synthesis'!J40)),\"X\",\"\")","v":""},{"$f":"IF(ISNUMBER(SEARCH(\"Interviews with experts\",'Data extraction-synthesis'!J40)),\"X\",\"\")","v":""},{"$f":"IF(ISNUMBER(SEARCH(\"Surveys with experts/expert opinion\",'Data extraction-synthesis'!J40)),\"X\",\"\")","v":""},{"$f":"IF(ISNUMBER(SEARCH(\"Consensus meeting inputs\",'Data extraction-synthesis'!J40)),\"X\",\"\")","v":""},{"$f":"IF(ISNUMBER(SEARCH(\"Available data\",'Data extraction-synthesis'!J40)),\"X\",\"\")","v":""},{"$f":"IF(ISNUMBER(SEARCH(\"Field observations\",'Data extraction-synthesis'!J40)),\"X\",\"\")","v":""},{"$f":"IF(ISNUMBER(SEARCH(\"Laboratory evaluations\",'Data extraction-synthesis'!J40)),\"X\",\"\")","v":""},{"$f":"IF(ISNUMBER(SEARCH(\"Models\",'Data extraction-synthesis'!J40)),\"X\",\"\")","v":""},{"$f":"IF(ISNUMBER(SEARCH(\"Early usability studies\",'Data extraction-synthesis'!J40)),\"X\",\"\")","v":""},{"$f":"IF(ISNUMBER(SEARCH(\"No input sources reported\",'Data extraction-synthesis'!J40)),\"X\",\"\")","v":""},{"$f":"IF(ISNUMBER(SEARCH(\"N/A\",'Data extraction-synthesis'!J40)),\"X\",\"\")","v":"X"},"N/A"]
["FIND","Target Product Profile for Tests for Recent HIV Infection",{"$f":"IF(ISNUMBER(SEARCH(\"Literature\",'Data extraction-synthesis'!J17)),\"X\",\"\")","v":""},{"$f":"IF(ISNUMBER(SEARCH(\"Industry standard\",'Data extraction-synthesis'!J17)),\"X\",\"\")","v":""},{"$f":"IF(ISNUMBER(SEARCH(\"Guidelines\",'Data extraction-synthesis'!J17)),\"X\",\"\")","v":""},{"$f":"IF(ISNUMBER(SEARCH(\"Interviews with experts\",'Data extraction-synthesis'!J17)),\"X\",\"\")","v":""},{"$f":"IF(ISNUMBER(SEARCH(\"Surveys with experts/expert opinion\",'Data extraction-synthesis'!J17)),\"X\",\"\")","v":""},{"$f":"IF(ISNUMBER(SEARCH(\"Consensus meeting inputs\",'Data extraction-synthesis'!J17)),\"X\",\"\")","v":""},{"$f":"IF(ISNUMBER(SEARCH(\"Available data\",'Data extraction-synthesis'!J17)),\"X\",\"\")","v":""},{"$f":"IF(ISNUMBER(SEARCH(\"Field observations\",'Data extraction-synthesis'!J17)),\"X\",\"\")","v":""},{"$f":"IF(ISNUMBER(SEARCH(\"Laboratory evaluations\",'Data extraction-synthesis'!J17)),\"X\",\"\")","v":""},{"$f":"IF(ISNUMBER(SEARCH(\"Models\",'Data extraction-synthesis'!J17)),\"X\",\"\")","v":""},{"$f":"IF(ISNUMBER(SEARCH(\"Early usability studies\",'Data extraction-synthesis'!J17)),\"X\",\"\")","v":""},{"$f":"IF(ISNUMBER(SEARCH(\"No input sources reported\",'Data extraction-synthesis'!J17)),\"X\",\"\")","v":"X"},{"$f":"IF(ISNUMBER(SEARCH(\"N/A\",'Data extraction-synthesis'!J17)),\"X\",\"\")","v":""},"N/A"]
["FIND","Target Product Profile: Rapid test for diagnosis of malaria and screening for hyman African trypanosomiasis (HAT)",{"$f":"IF(ISNUMBER(SEARCH(\"Literature\",'Data extraction-synthesis'!J18)),\"X\",\"\")","v":""},{"$f":"IF(ISNUMBER(SEARCH(\"Industry standard\",'Data extraction-synthesis'!J18)),\"X\",\"\")","v":""},{"$f":"IF(ISNUMBER(SEARCH(\"Guidelines\",'Data extraction-synthesis'!J18)),\"X\",\"\")","v":""},{"$f":"IF(ISNUMBER(SEARCH(\"Interviews with experts\",'Data extraction-synthesis'!J18)),\"X\",\"\")","v":""},{"$f":"IF(ISNUMBER(SEARCH(\"Surveys with experts/expert opinion\",'Data extraction-synthesis'!J18)),\"X\",\"\")","v":""},{"$f":"IF(ISNUMBER(SEARCH(\"Consensus meeting inputs\",'Data extraction-synthesis'!J18)),\"X\",\"\")","v":""},{"$f":"IF(ISNUMBER(SEARCH(\"Available data\",'Data extraction-synthesis'!J18)),\"X\",\"\")","v":""},{"$f":"IF(ISNUMBER(SEARCH(\"Field observations\",'Data extraction-synthesis'!J18)),\"X\",\"\")","v":""},{"$f":"IF(ISNUMBER(SEARCH(\"Laboratory evaluations\",'Data extraction-synthesis'!J18)),\"X\",\"\")","v":""},{"$f":"IF(ISNUMBER(SEARCH(\"Models\",'Data extraction-synthesis'!J18)),\"X\",\"\")","v":""},{"$f":"IF(ISNUMBER(SEARCH(\"Early usability studies\",'Data extraction-synthesis'!J18)),\"X\",\"\")","v":""},{"$f":"IF(ISNUMBER(SEARCH(\"No input sources reported\",'Data extraction-synthesis'!J18)),\"X\",\"\")","v":"X"},{"$f":"IF(ISNUMBER(SEARCH(\"N/A\",'Data extraction-synthesis'!J18)),\"X\",\"\")","v":""},"N/A"]
["FIND","Target Product Profile: Screening test for human African trypanosomiasis (HAT)",{"$f":"IF(ISNUMBER(SEARCH(\"Literature\",'Data extraction-synthesis'!J41)),\"X\",\"\")","v":""},{"$f":"IF(ISNUMBER(SEARCH(\"Industry standard\",'Data extraction-synthesis'!J41)),\"X\",\"\")","v":""},{"$f":"IF(ISNUMBER(SEARCH(\"Guidelines\",'Data extraction-synthesis'!J41)),\"X\",\"\")","v":""},{"$f":"IF(ISNUMBER(SEARCH(\"Interviews with experts\",'Data extraction-synthesis'!J41)),\"X\",\"\")","v":""},{"$f":"IF(ISNUMBER(SEARCH(\"Surveys with experts/expert opinion\",'Data extraction-synthesis'!J41)),\"X\",\"\")","v":""},{"$f":"IF(ISNUMBER(SEARCH(\"Consensus meeting inputs\",'Data extraction-synthesis'!J41)),\"X\",\"\")","v":""},{"$f":"IF(ISNUMBER(SEARCH(\"Available data\",'Data extraction-synthesis'!J41)),\"X\",\"\")","v":""},{"$f":"IF(ISNUMBER(SEARCH(\"Field observations\",'Data extraction-synthesis'!J41)),\"X\",\"\")","v":""},{"$f":"IF(ISNUMBER(SEARCH(\"Laboratory evaluations\",'Data extraction-synthesis'!J41)),\"X\",\"\")","v":""},{"$f":"IF(ISNUMBER(SEARCH(\"Models\",'Data extraction-synthesis'!J41)),\"X\",\"\")","v":""},{"$f":"IF(ISNUMBER(SEARCH(\"Early usability studies\",'Data extraction-synthesis'!J41)),\"X\",\"\")","v":""},{"$f":"IF(ISNUMBER(SEARCH(\"No input sources reported\",'Data extraction-synthesis'!J41)),\"X\",\"\")","v":"X"},{"$f":"IF(ISNUMBER(SEARCH(\"N/A\",'Data extraction-synthesis'!J41)),\"X\",\"\")","v":""},"N/A"]
["FIND","High-priority target product profile for hepatitis C diagnosis in decentralized settings: Report of a consensus meeting. ",{"$f":"IF(ISNUMBER(SEARCH(\"Literature\",'Data extraction-synthesis'!J8)),\"X\",\"\")","v":"X"},{"$f":"IF(ISNUMBER(SEARCH(\"Industry standard\",'Data extraction-synthesis'!J8)),\"X\",\"\")","v":""},{"$f":"IF(ISNUMBER(SEARCH(\"Guidelines\",'Data extraction-synthesis'!J8)),\"X\",\"\")","v":""},{"$f":"IF(ISNUMBER(SEARCH(\"Interviews with experts\",'Data extraction-synthesis'!J8)),\"X\",\"\")","v":""},null,{"$f":"IF(ISNUMBER(SEARCH(\"Consensus meeting inputs\",'Data extraction-synthesis'!J8)),\"X\",\"\")","v":""},{"$f":"IF(ISNUMBER(SEARCH(\"Available data\",'Data extraction-synthesis'!J8)),\"X\",\"\")","v":"X"},{"$f":"IF(ISNUMBER(SEARCH(\"Field observations\",'Data extraction-synthesis'!J8)),\"X\",\"\")","v":""},{"$f":"IF(ISNUMBER(SEARCH(\"Laboratory evaluations\",'Data extraction-synthesis'!J8)),\"X\",\"\")","v":""},null,{"$f":"IF(ISNUMBER(SEARCH(\"Early usability studies\",'Data extraction-synthesis'!J8)),\"X\",\"\")","v":""},{"$f":"IF(ISNUMBER(SEARCH(\"No input sources reported\",'Data extraction-synthesis'!J8)),\"X\",\"\")","v":""},{"$f":"IF(ISNUMBER(SEARCH(\"N/A\",'Data extraction-synthesis'!J8)),\"X\",\"\")","v":""},"YES"]
["Gal, M. F., N. A.: Hood, K.: Villacian, J.: Goossens, H.: Watkins, A.: Butler, C. C.","Matching diagnostics development to clinical need: Target product profile development for a point of care test for community-acquired lower respiratory tract infection",null,{"$f":"IF(ISNUMBER(SEARCH(\"Industry standard\",'Data extraction-synthesis'!J9)),\"X\",\"\")","v":""},{"$f":"IF(ISNUMBER(SEARCH(\"Guidelines\",'Data extraction-synthesis'!J9)),\"X\",\"\")","v":""},{"$f":"IF(ISNUMBER(SEARCH(\"Interviews with experts\",'Data extraction-synthesis'!J9)),\"X\",\"\")","v":""},{"$f":"IF(ISNUMBER(SEARCH(\"Surveys with experts/expert opinion\",'Data extraction-synthesis'!J9)),\"X\",\"\")","v":""},{"$f":"IF(ISNUMBER(SEARCH(\"Consensus meeting inputs\",'Data extraction-synthesis'!J9)),\"X\",\"\")","v":""},{"$f":"IF(ISNUMBER(SEARCH(\"Available data\",'Data extraction-synthesis'!J9)),\"X\",\"\")","v":""},{"$f":"IF(ISNUMBER(SEARCH(\"Field observations\",'Data extraction-synthesis'!J9)),\"X\",\"\")","v":""},{"$f":"IF(ISNUMBER(SEARCH(\"Laboratory evaluations\",'Data extraction-synthesis'!J9)),\"X\",\"\")","v":""},{"$f":"IF(ISNUMBER(SEARCH(\"Models\",'Data extraction-synthesis'!J9)),\"X\",\"\")","v":""},{"$f":"IF(ISNUMBER(SEARCH(\"Early usability studies\",'Data extraction-synthesis'!J9)),\"X\",\"\")","v":""},{"$f":"IF(ISNUMBER(SEARCH(\"No input sources reported\",'Data extraction-synthesis'!J9)),\"X\",\"\")","v":""},{"$f":"IF(ISNUMBER(SEARCH(\"N/A\",'Data extraction-synthesis'!J9)),\"X\",\"\")","v":""},"NO"]
["Internationa Diagnostics Centre (IDC)","Target Product Profile (TPP): Combined HIV/Syphilis Test",{"$f":"IF(ISNUMBER(SEARCH(\"Literature\",'Data extraction-synthesis'!J39)),\"X\",\"\")","v":""},{"$f":"IF(ISNUMBER(SEARCH(\"Industry standard\",'Data extraction-synthesis'!J39)),\"X\",\"\")","v":""},{"$f":"IF(ISNUMBER(SEARCH(\"Guidelines\",'Data extraction-synthesis'!J39)),\"X\",\"\")","v":""},{"$f":"IF(ISNUMBER(SEARCH(\"Interviews with experts\",'Data extraction-synthesis'!J39)),\"X\",\"\")","v":""},{"$f":"IF(ISNUMBER(SEARCH(\"Surveys with experts/expert opinion\",'Data extraction-synthesis'!J39)),\"X\",\"\")","v":""},{"$f":"IF(ISNUMBER(SEARCH(\"Consensus meeting inputs\",'Data extraction-synthesis'!J39)),\"X\",\"\")","v":""},{"$f":"IF(ISNUMBER(SEARCH(\"Available data\",'Data extraction-synthesis'!J39)),\"X\",\"\")","v":""},{"$f":"IF(ISNUMBER(SEARCH(\"Field observations\",'Data extraction-synthesis'!J39)),\"X\",\"\")","v":""},{"$f":"IF(ISNUMBER(SEARCH(\"Laboratory evaluations\",'Data extraction-synthesis'!J39)),\"X\",\"\")","v":""},{"$f":"IF(ISNUMBER(SEARCH(\"Models\",'Data extraction-synthesis'!J39)),\"X\",\"\")","v":""},{"$f":"IF(ISNUMBER(SEARCH(\"Early usability studies\",'Data extraction-synthesis'!J39)),\"X\",\"\")","v":""},{"$f":"IF(ISNUMBER(SEARCH(\"No input sources reported\",'Data extraction-synthesis'!J39)),\"X\",\"\")","v":"X"},{"$f":"IF(ISNUMBER(SEARCH(\"N/A\",'Data extraction-synthesis'!J39)),\"X\",\"\")","v":""},"N/A"]
["International Diagnostics Centre (IDC)","Target Product Profile (TPP) - Point-of-Care HIV Viral Load Test",{"$f":"IF(ISNUMBER(SEARCH(\"Literature\",'Data extraction-synthesis'!J36)),\"X\",\"\")","v":""},{"$f":"IF(ISNUMBER(SEARCH(\"Industry standard\",'Data extraction-synthesis'!J36)),\"X\",\"\")","v":""},{"$f":"IF(ISNUMBER(SEARCH(\"Guidelines\",'Data extraction-synthesis'!J36)),\"X\",\"\")","v":""},{"$f":"IF(ISNUMBER(SEARCH(\"Interviews with experts\",'Data extraction-synthesis'!J36)),\"X\",\"\")","v":""},{"$f":"IF(ISNUMBER(SEARCH(\"Surveys with experts/expert opinion\",'Data extraction-synthesis'!J36)),\"X\",\"\")","v":""},{"$f":"IF(ISNUMBER(SEARCH(\"Consensus meeting inputs\",'Data extraction-synthesis'!J36)),\"X\",\"\")","v":""},{"$f":"IF(ISNUMBER(SEARCH(\"Available data\",'Data extraction-synthesis'!J36)),\"X\",\"\")","v":""},{"$f":"IF(ISNUMBER(SEARCH(\"Field observations\",'Data extraction-synthesis'!J36)),\"X\",\"\")","v":""},{"$f":"IF(ISNUMBER(SEARCH(\"Laboratory evaluations\",'Data extraction-synthesis'!J36)),\"X\",\"\")","v":""},{"$f":"IF(ISNUMBER(SEARCH(\"Models\",'Data extraction-synthesis'!J36)),\"X\",\"\")","v":""},{"$f":"IF(ISNUMBER(SEARCH(\"Early usability studies\",'Data extraction-synthesis'!J36)),\"X\",\"\")","v":""},{"$f":"IF(ISNUMBER(SEARCH(\"No input sources reported\",'Data extraction-synthesis'!J36)),\"X\",\"\")","v":"X"},{"$f":"IF(ISNUMBER(SEARCH(\"N/A\",'Data extraction-synthesis'!J36)),\"X\",\"\")","v":""},"N/A"]
["International Diagnostics Centre (IDC)","Target Product Profile (TPP)- Point of care CD4 test",{"$f":"IF(ISNUMBER(SEARCH(\"Literature\",'Data extraction-synthesis'!J37)),\"X\",\"\")","v":""},{"$f":"IF(ISNUMBER(SEARCH(\"Industry standard\",'Data extraction-synthesis'!J37)),\"X\",\"\")","v":""},{"$f":"IF(ISNUMBER(SEARCH(\"Guidelines\",'Data extraction-synthesis'!J37)),\"X\",\"\")","v":""},{"$f":"IF(ISNUMBER(SEARCH(\"Interviews with experts\",'Data extraction-synthesis'!J37)),\"X\",\"\")","v":""},{"$f":"IF(ISNUMBER(SEARCH(\"Surveys with experts/expert opinion\",'Data extraction-synthesis'!J37)),\"X\",\"\")","v":""},{"$f":"IF(ISNUMBER(SEARCH(\"Consensus meeting inputs\",'Data extraction-synthesis'!J37)),\"X\",\"\")","v":""},{"$f":"IF(ISNUMBER(SEARCH(\"Available data\",'Data extraction-synthesis'!J37)),\"X\",\"\")","v":""},{"$f":"IF(ISNUMBER(SEARCH(\"Field observations\",'Data extraction-synthesis'!J37)),\"X\",\"\")","v":""},{"$f":"IF(ISNUMBER(SEARCH(\"Laboratory evaluations\",'Data extraction-synthesis'!J37)),\"X\",\"\")","v":""},{"$f":"IF(ISNUMBER(SEARCH(\"Models\",'Data extraction-synthesis'!J37)),\"X\",\"\")","v":""},{"$f":"IF(ISNUMBER(SEARCH(\"Early usability studies\",'Data extraction-synthesis'!J37)),\"X\",\"\")","v":""},{"$f":"IF(ISNUMBER(SEARCH(\"No input sources reported\",'Data extraction-synthesis'!J37)),\"X\",\"\")","v":"X"},{"$f":"IF(ISNUMBER(SEARCH(\"N/A\",'Data extraction-synthesis'!J37)),\"X\",\"\")","v":""},"N/A"]
["International Diagnostics Centre (IDC)","Target Product Profile (TPP): Point of care EID test",{"$f":"IF(ISNUMBER(SEARCH(\"Literature\",'Data extraction-synthesis'!J38)),\"X\",\"\")","v":""},{"$f":"IF(ISNUMBER(SEARCH(\"Industry standard\",'Data extraction-synthesis'!J38)),\"X\",\"\")","v":""},{"$f":"IF(ISNUMBER(SEARCH(\"Guidelines\",'Data extraction-synthesis'!J38)),\"X\",\"\")","v":""},{"$f":"IF(ISNUMBER(SEARCH(\"Interviews with experts\",'Data extraction-synthesis'!J38)),\"X\",\"\")","v":""},{"$f":"IF(ISNUMBER(SEARCH(\"Surveys with experts/expert opinion\",'Data extraction-synthesis'!J38)),\"X\",\"\")","v":""},{"$f":"IF(ISNUMBER(SEARCH(\"Consensus meeting inputs\",'Data extraction-synthesis'!J38)),\"X\",\"\")","v":""},{"$f":"IF(ISNUMBER(SEARCH(\"Available data\",'Data extraction-synthesis'!J38)),\"X\",\"\")","v":""},{"$f":"IF(ISNUMBER(SEARCH(\"Field observations\",'Data extraction-synthesis'!J38)),\"X\",\"\")","v":""},{"$f":"IF(ISNUMBER(SEARCH(\"Laboratory evaluations\",'Data extraction-synthesis'!J38)),\"X\",\"\")","v":""},{"$f":"IF(ISNUMBER(SEARCH(\"Models\",'Data extraction-synthesis'!J38)),\"X\",\"\")","v":""},{"$f":"IF(ISNUMBER(SEARCH(\"Early usability studies\",'Data extraction-synthesis'!J38)),\"X\",\"\")","v":""},{"$f":"IF(ISNUMBER(SEARCH(\"No input sources reported\",'Data extraction-synthesis'!J38)),\"X\",\"\")","v":"X"},{"$f":"IF(ISNUMBER(SEARCH(\"N/A\",'Data extraction-synthesis'!J38)),\"X\",\"\")","v":""},"N/A"]
["Lim, M. D. B., S. J.: Belizario, V. Y., Jr.: Gay-Andrieu, F.: Gilleard, J.: Levecke, B.: Lieshout, L. van: Medley, G. F.: Mekonnen, Z.: Mirams, G.: Njenga, S. M.: Odiere, M. R.: Rudge, J. W.: Stuyver, L.: Vercruysse, J.: Vlaminck, J.: Walson, J. L. ","Diagnostic tools for soil-transmitted helminths control and elimination programs: a pathway for diagnostic product development",null,{"$f":"IF(ISNUMBER(SEARCH(\"Industry standard\",'Data extraction-synthesis'!J10)),\"X\",\"\")","v":""},{"$f":"IF(ISNUMBER(SEARCH(\"Guidelines\",'Data extraction-synthesis'!J10)),\"X\",\"\")","v":""},{"$f":"IF(ISNUMBER(SEARCH(\"Interviews with experts\",'Data extraction-synthesis'!J10)),\"X\",\"\")","v":""},{"$f":"IF(ISNUMBER(SEARCH(\"Surveys with experts/expert opinion\",'Data extraction-synthesis'!J10)),\"X\",\"\")","v":""},{"$f":"IF(ISNUMBER(SEARCH(\"Consensus meeting inputs\",'Data extraction-synthesis'!J10)),\"X\",\"\")","v":""},{"$f":"IF(ISNUMBER(SEARCH(\"Available data\",'Data extraction-synthesis'!J10)),\"X\",\"\")","v":""},{"$f":"IF(ISNUMBER(SEARCH(\"Field observations\",'Data extraction-synthesis'!J10)),\"X\",\"\")","v":""},{"$f":"IF(ISNUMBER(SEARCH(\"Laboratory evaluations\",'Data extraction-synthesis'!J10)),\"X\",\"\")","v":""},{"$f":"IF(ISNUMBER(SEARCH(\"Models\",'Data extraction-synthesis'!J10)),\"X\",\"\")","v":""},{"$f":"IF(ISNUMBER(SEARCH(\"Early usability studies\",'Data extraction-synthesis'!J10)),\"X\",\"\")","v":""},"x",{"$f":"IF(ISNUMBER(SEARCH(\"N/A\",'Data extraction-synthesis'!J10)),\"X\",\"\")","v":""},"N/A"]
["Nsanzabana, C. A., Frederic: Beck, Hans-Peter: Ding, Xavier C.: Kamau, Edwin: Krishna, Sanjeev: Legrand, Eric: Lucchi, Naomi: Miotto, Olivo: Nag, Sidsel: Noedl, Harald: Roper, Cally: Rosenthal, Philip J.: Schallig, Henk D. F. H.: Taylor, Steve M.: Volkman, Sarah K.: Gonzalez, Iveth J.","Molecular assays for antimalarial drug resistance surveillance: A target product profile",{"$f":"IF(ISNUMBER(SEARCH(\"Literature\",'Data extraction-synthesis'!J11)),\"X\",\"\")","v":"X"},{"$f":"IF(ISNUMBER(SEARCH(\"Industry standard\",'Data extraction-synthesis'!J11)),\"X\",\"\")","v":""},{"$f":"IF(ISNUMBER(SEARCH(\"Guidelines\",'Data extraction-synthesis'!J11)),\"X\",\"\")","v":""},{"$f":"IF(ISNUMBER(SEARCH(\"Interviews with experts\",'Data extraction-synthesis'!J11)),\"X\",\"\")","v":""},{"$f":"IF(ISNUMBER(SEARCH(\"Surveys with experts/expert opinion\",'Data extraction-synthesis'!J11)),\"X\",\"\")","v":""},{"$f":"IF(ISNUMBER(SEARCH(\"Consensus meeting inputs\",'Data extraction-synthesis'!J11)),\"X\",\"\")","v":""},{"$f":"IF(ISNUMBER(SEARCH(\"Available data\",'Data extraction-synthesis'!J11)),\"X\",\"\")","v":""},{"$f":"IF(ISNUMBER(SEARCH(\"Field observations\",'Data extraction-synthesis'!J11)),\"X\",\"\")","v":""},{"$f":"IF(ISNUMBER(SEARCH(\"Laboratory evaluations\",'Data extraction-synthesis'!J11)),\"X\",\"\")","v":""},{"$f":"IF(ISNUMBER(SEARCH(\"Models\",'Data extraction-synthesis'!J11)),\"X\",\"\")","v":""},{"$f":"IF(ISNUMBER(SEARCH(\"Early usability studies\",'Data extraction-synthesis'!J11)),\"X\",\"\")","v":""},{"$f":"IF(ISNUMBER(SEARCH(\"No input sources reported\",'Data extraction-synthesis'!J11)),\"X\",\"\")","v":""},{"$f":"IF(ISNUMBER(SEARCH(\"N/A\",'Data extraction-synthesis'!J11)),\"X\",\"\")","v":""},"NO"]
["Pal S, Jasper L.E., Lawrence K.L, Walter M","Assessing the Dengue Diagnosis Capability Gap in the Military Health System",{"$f":"IF(ISNUMBER(SEARCH(\"Literature\",'Data extraction-synthesis'!J33)),\"X\",\"\")","v":""},{"$f":"IF(ISNUMBER(SEARCH(\"Industry standard\",'Data extraction-synthesis'!J33)),\"X\",\"\")","v":""},{"$f":"IF(ISNUMBER(SEARCH(\"Guidelines\",'Data extraction-synthesis'!J33)),\"X\",\"\")","v":""},{"$f":"IF(ISNUMBER(SEARCH(\"Interviews with experts\",'Data extraction-synthesis'!J33)),\"X\",\"\")","v":""},null,{"$f":"IF(ISNUMBER(SEARCH(\"Consensus meeting inputs\",'Data extraction-synthesis'!J33)),\"X\",\"\")","v":""},{"$f":"IF(ISNUMBER(SEARCH(\"Available data\",'Data extraction-synthesis'!J33)),\"X\",\"\")","v":""},{"$f":"IF(ISNUMBER(SEARCH(\"Field observations\",'Data extraction-synthesis'!J33)),\"X\",\"\")","v":""},{"$f":"IF(ISNUMBER(SEARCH(\"Laboratory evaluations\",'Data extraction-synthesis'!J33)),\"X\",\"\")","v":""},null,{"$f":"IF(ISNUMBER(SEARCH(\"Early usability studies\",'Data extraction-synthesis'!J33)),\"X\",\"\")","v":""},{"$f":"IF(ISNUMBER(SEARCH(\"No input sources reported\",'Data extraction-synthesis'!J33)),\"X\",\"\")","v":""},{"$f":"IF(ISNUMBER(SEARCH(\"N/A\",'Data extraction-synthesis'!J33)),\"X\",\"\")","v":""},"NO"]
["PATH","Target Product Profile: HIV Self-Test Version 4.1: A White Paper on the Evaluation of Current HIV Rapid Tests and Development of Core Specifications for Next-Generation HIV Tests",{"$f":"IF(ISNUMBER(SEARCH(\"Literature\",'Data extraction-synthesis'!J19)),\"X\",\"\")","v":"X"},{"$f":"IF(ISNUMBER(SEARCH(\"Industry standard\",'Data extraction-synthesis'!J19)),\"X\",\"\")","v":""},{"$f":"IF(ISNUMBER(SEARCH(\"Guidelines\",'Data extraction-synthesis'!J19)),\"X\",\"\")","v":""},{"$f":"IF(ISNUMBER(SEARCH(\"Interviews with experts\",'Data extraction-synthesis'!J19)),\"X\",\"\")","v":""},{"$f":"IF(ISNUMBER(SEARCH(\"Surveys with experts/expert opinion\",'Data extraction-synthesis'!J19)),\"X\",\"\")","v":""},{"$f":"IF(ISNUMBER(SEARCH(\"Consensus meeting inputs\",'Data extraction-synthesis'!J19)),\"X\",\"\")","v":""},{"$f":"IF(ISNUMBER(SEARCH(\"Available data\",'Data extraction-synthesis'!J19)),\"X\",\"\")","v":""},{"$f":"IF(ISNUMBER(SEARCH(\"Field observations\",'Data extraction-synthesis'!J19)),\"X\",\"\")","v":""},{"$f":"IF(ISNUMBER(SEARCH(\"Laboratory evaluations\",'Data extraction-synthesis'!J19)),\"X\",\"\")","v":"X"},{"$f":"IF(ISNUMBER(SEARCH(\"Models\",'Data extraction-synthesis'!J19)),\"X\",\"\")","v":""},{"$f":"IF(ISNUMBER(SEARCH(\"Early usability studies\",'Data extraction-synthesis'!J19)),\"X\",\"\")","v":"X"},{"$f":"IF(ISNUMBER(SEARCH(\"No input sources reported\",'Data extraction-synthesis'!J19)),\"X\",\"\")","v":""},{"$f":"IF(ISNUMBER(SEARCH(\"N/A\",'Data extraction-synthesis'!J19)),\"X\",\"\")","v":""},"YES"]
["PATH","Diagnostics for neglected tropical diseases: Defining the best tools through target product profiles",{"$f":"IF(ISNUMBER(SEARCH(\"Literature\",'Data extraction-synthesis'!J20)),\"X\",\"\")","v":""},{"$f":"IF(ISNUMBER(SEARCH(\"Industry standard\",'Data extraction-synthesis'!J20)),\"X\",\"\")","v":""},{"$f":"IF(ISNUMBER(SEARCH(\"Guidelines\",'Data extraction-synthesis'!J20)),\"X\",\"\")","v":""},{"$f":"IF(ISNUMBER(SEARCH(\"Interviews with experts\",'Data extraction-synthesis'!J20)),\"X\",\"\")","v":""},{"$f":"IF(ISNUMBER(SEARCH(\"Surveys with experts/expert opinion\",'Data extraction-synthesis'!J20)),\"X\",\"\")","v":""},{"$f":"IF(ISNUMBER(SEARCH(\"Consensus meeting inputs\",'Data extraction-synthesis'!J20)),\"X\",\"\")","v":""},{"$f":"IF(ISNUMBER(SEARCH(\"Available data\",'Data extraction-synthesis'!J20)),\"X\",\"\")","v":""},{"$f":"IF(ISNUMBER(SEARCH(\"Field observations\",'Data extraction-synthesis'!J20)),\"X\",\"\")","v":""},{"$f":"IF(ISNUMBER(SEARCH(\"Laboratory evaluations\",'Data extraction-synthesis'!J20)),\"X\",\"\")","v":""},{"$f":"IF(ISNUMBER(SEARCH(\"Models\",'Data extraction-synthesis'!J20)),\"X\",\"\")","v":""},{"$f":"IF(ISNUMBER(SEARCH(\"Early usability studies\",'Data extraction-synthesis'!J20)),\"X\",\"\")","v":""},{"$f":"IF(ISNUMBER(SEARCH(\"No input sources reported\",'Data extraction-synthesis'!J20)),\"X\",\"\")","v":""},{"$f":"IF(ISNUMBER(SEARCH(\"N/A\",'Data extraction-synthesis'!J20)),\"X\",\"\")","v":"X"},"N/A"]
["PATH","Target Product Profile: Schistosomiasis Surveillance Diagnostic",{"$f":"IF(ISNUMBER(SEARCH(\"Literature\",'Data extraction-synthesis'!J21)),\"X\",\"\")","v":"X"},{"$f":"IF(ISNUMBER(SEARCH(\"Industry standard\",'Data extraction-synthesis'!J21)),\"X\",\"\")","v":""},{"$f":"IF(ISNUMBER(SEARCH(\"Guidelines\",'Data extraction-synthesis'!J21)),\"X\",\"\")","v":""},{"$f":"IF(ISNUMBER(SEARCH(\"Interviews with experts\",'Data extraction-synthesis'!J21)),\"X\",\"\")","v":""},{"$f":"IF(ISNUMBER(SEARCH(\"Surveys with experts/expert opinion\",'Data extraction-synthesis'!J21)),\"X\",\"\")","v":""},{"$f":"IF(ISNUMBER(SEARCH(\"Consensus meeting inputs\",'Data extraction-synthesis'!J21)),\"X\",\"\")","v":""},{"$f":"IF(ISNUMBER(SEARCH(\"Available data\",'Data extraction-synthesis'!J21)),\"X\",\"\")","v":""},{"$f":"IF(ISNUMBER(SEARCH(\"Field observations\",'Data extraction-synthesis'!J21)),\"X\",\"\")","v":""},{"$f":"IF(ISNUMBER(SEARCH(\"Laboratory evaluations\",'Data extraction-synthesis'!J21)),\"X\",\"\")","v":""},{"$f":"IF(ISNUMBER(SEARCH(\"Models\",'Data extraction-synthesis'!J21)),\"X\",\"\")","v":""},{"$f":"IF(ISNUMBER(SEARCH(\"Early usability studies\",'Data extraction-synthesis'!J21)),\"X\",\"\")","v":""},{"$f":"IF(ISNUMBER(SEARCH(\"No input sources reported\",'Data extraction-synthesis'!J21)),\"X\",\"\")","v":""},{"$f":"IF(ISNUMBER(SEARCH(\"N/A\",'Data extraction-synthesis'!J21)),\"X\",\"\")","v":""},"NO"]
["PATH","Target Product Profile: Schistosomiasis Surveillance Diagnostic Lateral Flow Test CAA antigen",{"$f":"IF(ISNUMBER(SEARCH(\"Literature\",'Data extraction-synthesis'!J34)),\"X\",\"\")","v":"X"},{"$f":"IF(ISNUMBER(SEARCH(\"Industry standard\",'Data extraction-synthesis'!J34)),\"X\",\"\")","v":""},{"$f":"IF(ISNUMBER(SEARCH(\"Guidelines\",'Data extraction-synthesis'!J34)),\"X\",\"\")","v":""},{"$f":"IF(ISNUMBER(SEARCH(\"Interviews with experts\",'Data extraction-synthesis'!J34)),\"X\",\"\")","v":""},{"$f":"IF(ISNUMBER(SEARCH(\"Surveys with experts/expert opinion\",'Data extraction-synthesis'!J34)),\"X\",\"\")","v":""},{"$f":"IF(ISNUMBER(SEARCH(\"Consensus meeting inputs\",'Data extraction-synthesis'!J34)),\"X\",\"\")","v":""},{"$f":"IF(ISNUMBER(SEARCH(\"Available data\",'Data extraction-synthesis'!J34)),\"X\",\"\")","v":""},{"$f":"IF(ISNUMBER(SEARCH(\"Field observations\",'Data extraction-synthesis'!J34)),\"X\",\"\")","v":""},{"$f":"IF(ISNUMBER(SEARCH(\"Laboratory evaluations\",'Data extraction-synthesis'!J34)),\"X\",\"\")","v":""},{"$f":"IF(ISNUMBER(SEARCH(\"Models\",'Data extraction-synthesis'!J34)),\"X\",\"\")","v":""},{"$f":"IF(ISNUMBER(SEARCH(\"Early usability studies\",'Data extraction-synthesis'!J34)),\"X\",\"\")","v":""},{"$f":"IF(ISNUMBER(SEARCH(\"No input sources reported\",'Data extraction-synthesis'!J34)),\"X\",\"\")","v":""},{"$f":"IF(ISNUMBER(SEARCH(\"N/A\",'Data extraction-synthesis'!J34)),\"X\",\"\")","v":""},"NO"]
["PATH","Target Product Profile: Trachoma Surveillance Diagnostic-Post-Elimination Surveillance Antibody Lateral Flow Test",null,{"$f":"IF(ISNUMBER(SEARCH(\"Industry standard\",'Data extraction-synthesis'!J35)),\"X\",\"\")","v":""},{"$f":"IF(ISNUMBER(SEARCH(\"Guidelines\",'Data extraction-synthesis'!J35)),\"X\",\"\")","v":""},{"$f":"IF(ISNUMBER(SEARCH(\"Interviews with experts\",'Data extraction-synthesis'!J35)),\"X\",\"\")","v":""},{"$f":"IF(ISNUMBER(SEARCH(\"Surveys with experts/expert opinion\",'Data extraction-synthesis'!J35)),\"X\",\"\")","v":""},{"$f":"IF(ISNUMBER(SEARCH(\"Consensus meeting inputs\",'Data extraction-synthesis'!J35)),\"X\",\"\")","v":""},{"$f":"IF(ISNUMBER(SEARCH(\"Available data\",'Data extraction-synthesis'!J35)),\"X\",\"\")","v":""},{"$f":"IF(ISNUMBER(SEARCH(\"Field observations\",'Data extraction-synthesis'!J35)),\"X\",\"\")","v":""},{"$f":"IF(ISNUMBER(SEARCH(\"Laboratory evaluations\",'Data extraction-synthesis'!J35)),\"X\",\"\")","v":""},{"$f":"IF(ISNUMBER(SEARCH(\"Models\",'Data extraction-synthesis'!J35)),\"X\",\"\")","v":""},{"$f":"IF(ISNUMBER(SEARCH(\"Early usability studies\",'Data extraction-synthesis'!J35)),\"X\",\"\")","v":""},"x",{"$f":"IF(ISNUMBER(SEARCH(\"N/A\",'Data extraction-synthesis'!J35)),\"X\",\"\")","v":""},"N/A"]
["PATH","Target Product Profile: Trachoma surveillance diagnostic-antigen lateral flow test",{"$f":"IF(ISNUMBER(SEARCH(\"Literature\",'Data extraction-synthesis'!J42)),\"X\",\"\")","v":"X"},{"$f":"IF(ISNUMBER(SEARCH(\"Industry standard\",'Data extraction-synthesis'!J42)),\"X\",\"\")","v":""},{"$f":"IF(ISNUMBER(SEARCH(\"Guidelines\",'Data extraction-synthesis'!J42)),\"X\",\"\")","v":""},{"$f":"IF(ISNUMBER(SEARCH(\"Interviews with experts\",'Data extraction-synthesis'!J42)),\"X\",\"\")","v":""},{"$f":"IF(ISNUMBER(SEARCH(\"Surveys with experts/expert opinion\",'Data extraction-synthesis'!J42)),\"X\",\"\")","v":""},{"$f":"IF(ISNUMBER(SEARCH(\"Consensus meeting inputs\",'Data extraction-synthesis'!J42)),\"X\",\"\")","v":""},{"$f":"IF(ISNUMBER(SEARCH(\"Available data\",'Data extraction-synthesis'!J42)),\"X\",\"\")","v":""},{"$f":"IF(ISNUMBER(SEARCH(\"Field observations\",'Data extraction-synthesis'!J42)),\"X\",\"\")","v":""},{"$f":"IF(ISNUMBER(SEARCH(\"Laboratory evaluations\",'Data extraction-synthesis'!J42)),\"X\",\"\")","v":""},{"$f":"IF(ISNUMBER(SEARCH(\"Models\",'Data extraction-synthesis'!J42)),\"X\",\"\")","v":""},{"$f":"IF(ISNUMBER(SEARCH(\"Early usability studies\",'Data extraction-synthesis'!J42)),\"X\",\"\")","v":""},{"$f":"IF(ISNUMBER(SEARCH(\"No input sources reported\",'Data extraction-synthesis'!J42)),\"X\",\"\")","v":""},{"$f":"IF(ISNUMBER(SEARCH(\"N/A\",'Data extraction-synthesis'!J42)),\"X\",\"\")","v":""},"NO"]
["PATH","Target Product Profile: Schistosomiasis Surveillance Diagnostic - schistosoma genus-specific antibody lateral flow test post-elimination surveillance",{"$f":"IF(ISNUMBER(SEARCH(\"Literature\",'Data extraction-synthesis'!J44)),\"X\",\"\")","v":"X"},{"$f":"IF(ISNUMBER(SEARCH(\"Industry standard\",'Data extraction-synthesis'!J44)),\"X\",\"\")","v":""},{"$f":"IF(ISNUMBER(SEARCH(\"Guidelines\",'Data extraction-synthesis'!J44)),\"X\",\"\")","v":""},{"$f":"IF(ISNUMBER(SEARCH(\"Interviews with experts\",'Data extraction-synthesis'!J44)),\"X\",\"\")","v":""},{"$f":"IF(ISNUMBER(SEARCH(\"Surveys with experts/expert opinion\",'Data extraction-synthesis'!J44)),\"X\",\"\")","v":""},{"$f":"IF(ISNUMBER(SEARCH(\"Consensus meeting inputs\",'Data extraction-synthesis'!J44)),\"X\",\"\")","v":""},{"$f":"IF(ISNUMBER(SEARCH(\"Available data\",'Data extraction-synthesis'!J44)),\"X\",\"\")","v":""},{"$f":"IF(ISNUMBER(SEARCH(\"Field observations\",'Data extraction-synthesis'!J44)),\"X\",\"\")","v":""},{"$f":"IF(ISNUMBER(SEARCH(\"Laboratory evaluations\",'Data extraction-synthesis'!J44)),\"X\",\"\")","v":""},{"$f":"IF(ISNUMBER(SEARCH(\"Models\",'Data extraction-synthesis'!J44)),\"X\",\"\")","v":""},{"$f":"IF(ISNUMBER(SEARCH(\"Early usability studies\",'Data extraction-synthesis'!J44)),\"X\",\"\")","v":""},{"$f":"IF(ISNUMBER(SEARCH(\"No input sources reported\",'Data extraction-synthesis'!J44)),\"X\",\"\")","v":""},{"$f":"IF(ISNUMBER(SEARCH(\"N/A\",'Data extraction-synthesis'!J44)),\"X\",\"\")","v":""},"NO"]
["Peck, R. B. W., J. D.: Boettcher, M. G.: Downing","Defining product requirements for field deployable yellow fever tests",{"$f":"IF(ISNUMBER(SEARCH(\"Literature\",'Data extraction-synthesis'!J43)),\"X\",\"\")","v":""},{"$f":"IF(ISNUMBER(SEARCH(\"Industry standard\",'Data extraction-synthesis'!J43)),\"X\",\"\")","v":""},{"$f":"IF(ISNUMBER(SEARCH(\"Guidelines\",'Data extraction-synthesis'!J43)),\"X\",\"\")","v":""},{"$f":"IF(ISNUMBER(SEARCH(\"Interviews with experts\",'Data extraction-synthesis'!J43)),\"X\",\"\")","v":""},{"$f":"IF(ISNUMBER(SEARCH(\"Surveys with experts/expert opinion\",'Data extraction-synthesis'!J43)),\"X\",\"\")","v":""},{"$f":"IF(ISNUMBER(SEARCH(\"Consensus meeting inputs\",'Data extraction-synthesis'!J43)),\"X\",\"\")","v":""},{"$f":"IF(ISNUMBER(SEARCH(\"Available data\",'Data extraction-synthesis'!J43)),\"X\",\"\")","v":""},{"$f":"IF(ISNUMBER(SEARCH(\"Field observations\",'Data extraction-synthesis'!J43)),\"X\",\"\")","v":""},{"$f":"IF(ISNUMBER(SEARCH(\"Laboratory evaluations\",'Data extraction-synthesis'!J43)),\"X\",\"\")","v":""},{"$f":"IF(ISNUMBER(SEARCH(\"Models\",'Data extraction-synthesis'!J43)),\"X\",\"\")","v":""},{"$f":"IF(ISNUMBER(SEARCH(\"Early usability studies\",'Data extraction-synthesis'!J43)),\"X\",\"\")","v":""},{"$f":"IF(ISNUMBER(SEARCH(\"No input sources reported\",'Data extraction-synthesis'!J43)),\"X\",\"\")","v":""},{"$f":"IF(ISNUMBER(SEARCH(\"N/A\",'Data extraction-synthesis'!J43)),\"X\",\"\")","v":"X"},"N/A"]
["Porras, A. I. Y., Z. E.: Altcheh, J.: Britto, C.: Chaves, G. C.: Flevaud, L.: Martins, O. A.: Ribeiro, I.: Schijman, A. G.: Shikanai-Yasuda, M. A.: Sosa-Estani, S.: Stobbaerts, E.: Zicker, F.","Target Product Profile (TPP) for Chagas Disease Point-of-Care Diagnosis and Assessment of Response to Treatmen",{"$f":"IF(ISNUMBER(SEARCH(\"Literature\",'Data extraction-synthesis'!J12)),\"X\",\"\")","v":""},{"$f":"IF(ISNUMBER(SEARCH(\"Industry standard\",'Data extraction-synthesis'!J12)),\"X\",\"\")","v":""},{"$f":"IF(ISNUMBER(SEARCH(\"Guidelines\",'Data extraction-synthesis'!J12)),\"X\",\"\")","v":""},{"$f":"IF(ISNUMBER(SEARCH(\"Interviews with experts\",'Data extraction-synthesis'!J12)),\"X\",\"\")","v":""},{"$f":"IF(ISNUMBER(SEARCH(\"Surveys with experts/expert opinion\",'Data extraction-synthesis'!J12)),\"X\",\"\")","v":""},{"$f":"IF(ISNUMBER(SEARCH(\"Consensus meeting inputs\",'Data extraction-synthesis'!J12)),\"X\",\"\")","v":""},{"$f":"IF(ISNUMBER(SEARCH(\"Available data\",'Data extraction-synthesis'!J12)),\"X\",\"\")","v":""},{"$f":"IF(ISNUMBER(SEARCH(\"Field observations\",'Data extraction-synthesis'!J12)),\"X\",\"\")","v":""},{"$f":"IF(ISNUMBER(SEARCH(\"Laboratory evaluations\",'Data extraction-synthesis'!J12)),\"X\",\"\")","v":""},{"$f":"IF(ISNUMBER(SEARCH(\"Models\",'Data extraction-synthesis'!J12)),\"X\",\"\")","v":""},{"$f":"IF(ISNUMBER(SEARCH(\"Early usability studies\",'Data extraction-synthesis'!J12)),\"X\",\"\")","v":""},{"$f":"IF(ISNUMBER(SEARCH(\"No input sources reported\",'Data extraction-synthesis'!J12)),\"X\",\"\")","v":"X"},{"$f":"IF(ISNUMBER(SEARCH(\"N/A\",'Data extraction-synthesis'!J12)),\"X\",\"\")","v":""},"N/A"]
["Reipold, E. I. E., Philippa: Trianni, Alessandra: Panneer, Nivedha: Krakower, Douglas: Ongarello, Stefano: Roberts, Teri: Miller, Veronica: Denkinger, Claudia","Optimising diagnosis of viraemic hepatitis C infection: the development of a target product profile",{"$f":"IF(ISNUMBER(SEARCH(\"Literature\",'Data extraction-synthesis'!J13)),\"X\",\"\")","v":"X"},{"$f":"IF(ISNUMBER(SEARCH(\"Industry standard\",'Data extraction-synthesis'!J13)),\"X\",\"\")","v":""},{"$f":"IF(ISNUMBER(SEARCH(\"Guidelines\",'Data extraction-synthesis'!J13)),\"X\",\"\")","v":""},{"$f":"IF(ISNUMBER(SEARCH(\"Interviews with experts\",'Data extraction-synthesis'!J13)),\"X\",\"\")","v":""},null,{"$f":"IF(ISNUMBER(SEARCH(\"Consensus meeting inputs\",'Data extraction-synthesis'!J13)),\"X\",\"\")","v":""},"x",{"$f":"IF(ISNUMBER(SEARCH(\"Field observations\",'Data extraction-synthesis'!J13)),\"X\",\"\")","v":""},{"$f":"IF(ISNUMBER(SEARCH(\"Laboratory evaluations\",'Data extraction-synthesis'!J13)),\"X\",\"\")","v":""},null,{"$f":"IF(ISNUMBER(SEARCH(\"Early usability studies\",'Data extraction-synthesis'!J13)),\"X\",\"\")","v":""},{"$f":"IF(ISNUMBER(SEARCH(\"No input sources reported\",'Data extraction-synthesis'!J13)),\"X\",\"\")","v":""},{"$f":"IF(ISNUMBER(SEARCH(\"N/A\",'Data extraction-synthesis'!J13)),\"X\",\"\")","v":""},"YES"]
["Solomon, A. W. E., D.: Bailey, R. L.: Blake, I. M.: Brooker, S.: Chen, J. X.: Chen, J. H.: Churcher, T. S.: Drakeley, C. J.: Edwards, T.: Fenwick, A.: French, M.: Gabrielli, A. F.: Grassly, N. C.: Harding-Esch, E. M.: Holland, M. J.: Koukounari, A.: Lammie, P. J.: Leslie, J.: Mabey, D. C.: Rhajaoui, M.: Secor, W. E.: Stothard, J. R.: Wei, H.: Willingham, A. L.: Zhou, X. N.: Peeling, R. W.","A diagnostics platform for the integrated mapping, monitoring, and surveillance of neglected tropical diseases: Rationale and target product profiles",{"$f":"IF(ISNUMBER(SEARCH(\"Literature\",'Data extraction-synthesis'!J14)),\"X\",\"\")","v":""},{"$f":"IF(ISNUMBER(SEARCH(\"Industry standard\",'Data extraction-synthesis'!J14)),\"X\",\"\")","v":""},{"$f":"IF(ISNUMBER(SEARCH(\"Guidelines\",'Data extraction-synthesis'!J14)),\"X\",\"\")","v":""},{"$f":"IF(ISNUMBER(SEARCH(\"Interviews with experts\",'Data extraction-synthesis'!J14)),\"X\",\"\")","v":""},{"$f":"IF(ISNUMBER(SEARCH(\"Surveys with experts/expert opinion\",'Data extraction-synthesis'!J14)),\"X\",\"\")","v":""},{"$f":"IF(ISNUMBER(SEARCH(\"Consensus meeting inputs\",'Data extraction-synthesis'!J14)),\"X\",\"\")","v":""},{"$f":"IF(ISNUMBER(SEARCH(\"Available data\",'Data extraction-synthesis'!J14)),\"X\",\"\")","v":""},{"$f":"IF(ISNUMBER(SEARCH(\"Field observations\",'Data extraction-synthesis'!J14)),\"X\",\"\")","v":""},{"$f":"IF(ISNUMBER(SEARCH(\"Laboratory evaluations\",'Data extraction-synthesis'!J14)),\"X\",\"\")","v":""},{"$f":"IF(ISNUMBER(SEARCH(\"Models\",'Data extraction-synthesis'!J14)),\"X\",\"\")","v":""},{"$f":"IF(ISNUMBER(SEARCH(\"Early usability studies\",'Data extraction-synthesis'!J14)),\"X\",\"\")","v":""},{"$f":"IF(ISNUMBER(SEARCH(\"No input sources reported\",'Data extraction-synthesis'!J14)),\"X\",\"\")","v":"X"},{"$f":"IF(ISNUMBER(SEARCH(\"N/A\",'Data extraction-synthesis'!J14)),\"X\",\"\")","v":""},"N/A"]
["Toskin, I. M., M.: Peeling, R. W.: Blondeel, K.: Cordero, J.: Kiarie, J.","Advancing prevention of sexually transmitted infections through point-of-care testing: target product profiles and landscape analysis",{"$f":"IF(ISNUMBER(SEARCH(\"Literature\",'Data extraction-synthesis'!J15)),\"X\",\"\")","v":""},{"$f":"IF(ISNUMBER(SEARCH(\"Industry standard\",'Data extraction-synthesis'!J15)),\"X\",\"\")","v":""},{"$f":"IF(ISNUMBER(SEARCH(\"Guidelines\",'Data extraction-synthesis'!J15)),\"X\",\"\")","v":""},{"$f":"IF(ISNUMBER(SEARCH(\"Interviews with experts\",'Data extraction-synthesis'!J15)),\"X\",\"\")","v":""},{"$f":"IF(ISNUMBER(SEARCH(\"Surveys with experts/expert opinion\",'Data extraction-synthesis'!J15)),\"X\",\"\")","v":""},null,{"$f":"IF(ISNUMBER(SEARCH(\"Available data\",'Data extraction-synthesis'!J15)),\"X\",\"\")","v":""},{"$f":"IF(ISNUMBER(SEARCH(\"Field observations\",'Data extraction-synthesis'!J15)),\"X\",\"\")","v":""},{"$f":"IF(ISNUMBER(SEARCH(\"Laboratory evaluations\",'Data extraction-synthesis'!J15)),\"X\",\"\")","v":""},{"$f":"IF(ISNUMBER(SEARCH(\"Models\",'Data extraction-synthesis'!J15)),\"X\",\"\")","v":""},{"$f":"IF(ISNUMBER(SEARCH(\"Early usability studies\",'Data extraction-synthesis'!J15)),\"X\",\"\")","v":""},{"$f":"IF(ISNUMBER(SEARCH(\"No input sources reported\",'Data extraction-synthesis'!J15)),\"X\",\"\")","v":""},{"$f":"IF(ISNUMBER(SEARCH(\"N/A\",'Data extraction-synthesis'!J15)),\"X\",\"\")","v":""},"NO"]
["UNICEF","UNICEF Target Product Profile Rapid E.coli Detection (version 2.0)",{"$f":"IF(ISNUMBER(SEARCH(\"Literature\",'Data extraction-synthesis'!#REF!)),\"X\",\"\")","v":""},{"$f":"IF(ISNUMBER(SEARCH(\"Industry standard\",'Data extraction-synthesis'!#REF!)),\"X\",\"\")","v":""},{"$f":"IF(ISNUMBER(SEARCH(\"Guidelines\",'Data extraction-synthesis'!#REF!)),\"X\",\"\")","v":""},{"$f":"IF(ISNUMBER(SEARCH(\"Interviews with experts\",'Data extraction-synthesis'!#REF!)),\"X\",\"\")","v":""},{"$f":"IF(ISNUMBER(SEARCH(\"Surveys with experts/expert opinion\",'Data extraction-synthesis'!#REF!)),\"X\",\"\")","v":""},{"$f":"IF(ISNUMBER(SEARCH(\"Consensus meeting inputs\",'Data extraction-synthesis'!#REF!)),\"X\",\"\")","v":""},{"$f":"IF(ISNUMBER(SEARCH(\"Available data\",'Data extraction-synthesis'!#REF!)),\"X\",\"\")","v":""},{"$f":"IF(ISNUMBER(SEARCH(\"Field observations\",'Data extraction-synthesis'!#REF!)),\"X\",\"\")","v":""},{"$f":"IF(ISNUMBER(SEARCH(\"Laboratory evaluations\",'Data extraction-synthesis'!#REF!)),\"X\",\"\")","v":""},{"$f":"IF(ISNUMBER(SEARCH(\"Models\",'Data extraction-synthesis'!#REF!)),\"X\",\"\")","v":""},{"$f":"IF(ISNUMBER(SEARCH(\"Early usability studies\",'Data extraction-synthesis'!#REF!)),\"X\",\"\")","v":""},{"$f":"IF(ISNUMBER(SEARCH(\"No input sources reported\",'Data extraction-synthesis'!J22)),\"X\",\"\")","v":"X"},{"$f":"IF(ISNUMBER(SEARCH(\"N/A\",'Data extraction-synthesis'!#REF!)),\"X\",\"\")","v":""},"N/A"]
["UNICEF","UNICEF Target Product Profile Rapid E.coli Detection (1.4)",{"$f":"IF(ISNUMBER(SEARCH(\"Literature\",'Data extraction-synthesis'!J22)),\"X\",\"\")","v":""},{"$f":"IF(ISNUMBER(SEARCH(\"Industry standard\",'Data extraction-synthesis'!J22)),\"X\",\"\")","v":""},{"$f":"IF(ISNUMBER(SEARCH(\"Guidelines\",'Data extraction-synthesis'!J22)),\"X\",\"\")","v":""},{"$f":"IF(ISNUMBER(SEARCH(\"Interviews with experts\",'Data extraction-synthesis'!J22)),\"X\",\"\")","v":""},{"$f":"IF(ISNUMBER(SEARCH(\"Surveys with experts/expert opinion\",'Data extraction-synthesis'!J22)),\"X\",\"\")","v":""},{"$f":"IF(ISNUMBER(SEARCH(\"Consensus meeting inputs\",'Data extraction-synthesis'!J22)),\"X\",\"\")","v":""},{"$f":"IF(ISNUMBER(SEARCH(\"Available data\",'Data extraction-synthesis'!J22)),\"X\",\"\")","v":""},{"$f":"IF(ISNUMBER(SEARCH(\"Field observations\",'Data extraction-synthesis'!J22)),\"X\",\"\")","v":""},{"$f":"IF(ISNUMBER(SEARCH(\"Laboratory evaluations\",'Data extraction-synthesis'!J22)),\"X\",\"\")","v":""},{"$f":"IF(ISNUMBER(SEARCH(\"Models\",'Data extraction-synthesis'!J22)),\"X\",\"\")","v":""},{"$f":"IF(ISNUMBER(SEARCH(\"Early usability studies\",'Data extraction-synthesis'!J22)),\"X\",\"\")","v":""},{"$f":"IF(ISNUMBER(SEARCH(\"No input sources reported\",'Data extraction-synthesis'!J23)),\"X\",\"\")","v":"X"},{"$f":"IF(ISNUMBER(SEARCH(\"N/A\",'Data extraction-synthesis'!J22)),\"X\",\"\")","v":""},"N/A"]
["UNICEF","Zika Virus Diagnostics: Target Product Profiles & Supply Update",{"$f":"IF(ISNUMBER(SEARCH(\"Literature\",'Data extraction-synthesis'!J31)),\"X\",\"\")","v":""},{"$f":"IF(ISNUMBER(SEARCH(\"Industry standard\",'Data extraction-synthesis'!J31)),\"X\",\"\")","v":""},{"$f":"IF(ISNUMBER(SEARCH(\"Guidelines\",'Data extraction-synthesis'!J31)),\"X\",\"\")","v":""},{"$f":"IF(ISNUMBER(SEARCH(\"Interviews with experts\",'Data extraction-synthesis'!J31)),\"X\",\"\")","v":""},{"$f":"IF(ISNUMBER(SEARCH(\"Surveys with experts/expert opinion\",'Data extraction-synthesis'!J31)),\"X\",\"\")","v":""},{"$f":"IF(ISNUMBER(SEARCH(\"Consensus meeting inputs\",'Data extraction-synthesis'!J31)),\"X\",\"\")","v":""},{"$f":"IF(ISNUMBER(SEARCH(\"Available data\",'Data extraction-synthesis'!J31)),\"X\",\"\")","v":""},{"$f":"IF(ISNUMBER(SEARCH(\"Field observations\",'Data extraction-synthesis'!J31)),\"X\",\"\")","v":""},{"$f":"IF(ISNUMBER(SEARCH(\"Laboratory evaluations\",'Data extraction-synthesis'!J31)),\"X\",\"\")","v":""},{"$f":"IF(ISNUMBER(SEARCH(\"Models\",'Data extraction-synthesis'!J31)),\"X\",\"\")","v":""},{"$f":"IF(ISNUMBER(SEARCH(\"Early usability studies\",'Data extraction-synthesis'!J31)),\"X\",\"\")","v":""},{"$f":"IF(ISNUMBER(SEARCH(\"No input sources reported\",'Data extraction-synthesis'!J31)),\"X\",\"\")","v":""},{"$f":"IF(ISNUMBER(SEARCH(\"N/A\",'Data extraction-synthesis'!J31)),\"X\",\"\")","v":"X"},"N/A"]
["UNICEF","Pneumonia Acute Respiratory Infection Diagnostic Aid-Target Product Profile Introduction",{"$f":"IF(ISNUMBER(SEARCH(\"Literature\",'Data extraction-synthesis'!J32)),\"X\",\"\")","v":""},{"$f":"IF(ISNUMBER(SEARCH(\"Industry standard\",'Data extraction-synthesis'!J32)),\"X\",\"\")","v":""},{"$f":"IF(ISNUMBER(SEARCH(\"Guidelines\",'Data extraction-synthesis'!J32)),\"X\",\"\")","v":""},{"$f":"IF(ISNUMBER(SEARCH(\"Interviews with experts\",'Data extraction-synthesis'!J32)),\"X\",\"\")","v":""},{"$f":"IF(ISNUMBER(SEARCH(\"Surveys with experts/expert opinion\",'Data extraction-synthesis'!J32)),\"X\",\"\")","v":""},{"$f":"IF(ISNUMBER(SEARCH(\"Consensus meeting inputs\",'Data extraction-synthesis'!J32)),\"X\",\"\")","v":""},{"$f":"IF(ISNUMBER(SEARCH(\"Available data\",'Data extraction-synthesis'!J32)),\"X\",\"\")","v":""},{"$f":"IF(ISNUMBER(SEARCH(\"Field observations\",'Data extraction-synthesis'!J32)),\"X\",\"\")","v":""},{"$f":"IF(ISNUMBER(SEARCH(\"Laboratory evaluations\",'Data extraction-synthesis'!J32)),\"X\",\"\")","v":""},{"$f":"IF(ISNUMBER(SEARCH(\"Models\",'Data extraction-synthesis'!J32)),\"X\",\"\")","v":""},{"$f":"IF(ISNUMBER(SEARCH(\"Early usability studies\",'Data extraction-synthesis'!J32)),\"X\",\"\")","v":""},{"$f":"IF(ISNUMBER(SEARCH(\"No input sources reported\",'Data extraction-synthesis'!J32)),\"X\",\"\")","v":""},{"$f":"IF(ISNUMBER(SEARCH(\"N/A\",'Data extraction-synthesis'!J32)),\"X\",\"\")","v":"X"},"N/A"]
["Utzinger, J. B., S. L.: van Lieshout, L.: van Dam, G. J.: Knopp, S","New diagnostic tools in schistosomiasis",{"$f":"IF(ISNUMBER(SEARCH(\"Literature\",'Data extraction-synthesis'!J30)),\"X\",\"\")","v":""},{"$f":"IF(ISNUMBER(SEARCH(\"Industry standard\",'Data extraction-synthesis'!J30)),\"X\",\"\")","v":""},{"$f":"IF(ISNUMBER(SEARCH(\"Guidelines\",'Data extraction-synthesis'!J30)),\"X\",\"\")","v":""},{"$f":"IF(ISNUMBER(SEARCH(\"Interviews with experts\",'Data extraction-synthesis'!J30)),\"X\",\"\")","v":""},{"$f":"IF(ISNUMBER(SEARCH(\"Surveys with experts/expert opinion\",'Data extraction-synthesis'!J30)),\"X\",\"\")","v":""},{"$f":"IF(ISNUMBER(SEARCH(\"Consensus meeting inputs\",'Data extraction-synthesis'!J30)),\"X\",\"\")","v":""},{"$f":"IF(ISNUMBER(SEARCH(\"Available data\",'Data extraction-synthesis'!J30)),\"X\",\"\")","v":""},{"$f":"IF(ISNUMBER(SEARCH(\"Field observations\",'Data extraction-synthesis'!J30)),\"X\",\"\")","v":""},{"$f":"IF(ISNUMBER(SEARCH(\"Laboratory evaluations\",'Data extraction-synthesis'!J30)),\"X\",\"\")","v":""},{"$f":"IF(ISNUMBER(SEARCH(\"Models\",'Data extraction-synthesis'!J30)),\"X\",\"\")","v":""},{"$f":"IF(ISNUMBER(SEARCH(\"Early usability studies\",'Data extraction-synthesis'!J30)),\"X\",\"\")","v":""},{"$f":"IF(ISNUMBER(SEARCH(\"No input sources reported\",'Data extraction-synthesis'!J30)),\"X\",\"\")","v":""},{"$f":"IF(ISNUMBER(SEARCH(\"N/A\",'Data extraction-synthesis'!J30)),\"X\",\"\")","v":"X"},"N/A"]
["WHO","High-priority target product profile for new tubercolosis diagnostics: report of a consensus meeting",{"$f":"IF(ISNUMBER(SEARCH(\"Literature\",'Data extraction-synthesis'!J24)),\"X\",\"\")","v":"X"},{"$f":"IF(ISNUMBER(SEARCH(\"Industry standard\",'Data extraction-synthesis'!J24)),\"X\",\"\")","v":""},{"$f":"IF(ISNUMBER(SEARCH(\"Guidelines\",'Data extraction-synthesis'!J24)),\"X\",\"\")","v":""},{"$f":"IF(ISNUMBER(SEARCH(\"Interviews with experts\",'Data extraction-synthesis'!J24)),\"X\",\"\")","v":""},{"$f":"IF(ISNUMBER(SEARCH(\"Surveys with experts/expert opinion\",'Data extraction-synthesis'!J24)),\"X\",\"\")","v":"X"},{"$f":"IF(ISNUMBER(SEARCH(\"Consensus meeting inputs\",'Data extraction-synthesis'!J24)),\"X\",\"\")","v":""},{"$f":"IF(ISNUMBER(SEARCH(\"Available data\",'Data extraction-synthesis'!J24)),\"X\",\"\")","v":""},{"$f":"IF(ISNUMBER(SEARCH(\"Field observations\",'Data extraction-synthesis'!J24)),\"X\",\"\")","v":""},{"$f":"IF(ISNUMBER(SEARCH(\"Laboratory evaluations\",'Data extraction-synthesis'!J24)),\"X\",\"\")","v":""},{"$f":"IF(ISNUMBER(SEARCH(\"Models\",'Data extraction-synthesis'!J24)),\"X\",\"\")","v":"X"},{"$f":"IF(ISNUMBER(SEARCH(\"Early usability studies\",'Data extraction-synthesis'!J24)),\"X\",\"\")","v":""},{"$f":"IF(ISNUMBER(SEARCH(\"No input sources reported\",'Data extraction-synthesis'!J24)),\"X\",\"\")","v":""},{"$f":"IF(ISNUMBER(SEARCH(\"N/A\",'Data extraction-synthesis'!J24)),\"X\",\"\")","v":""},"YES"]
["WHO","Development of a Target Product Profile (TPP) and framework for evaluation for a test predicting progression from tubercolosis infection to active disease",{"$f":"IF(ISNUMBER(SEARCH(\"Literature\",'Data extraction-synthesis'!J25)),\"X\",\"\")","v":""},{"$f":"IF(ISNUMBER(SEARCH(\"Industry standard\",'Data extraction-synthesis'!J25)),\"X\",\"\")","v":""},{"$f":"IF(ISNUMBER(SEARCH(\"Guidelines\",'Data extraction-synthesis'!J25)),\"X\",\"\")","v":""},{"$f":"IF(ISNUMBER(SEARCH(\"Interviews with experts\",'Data extraction-synthesis'!J25)),\"X\",\"\")","v":""},{"$f":"IF(ISNUMBER(SEARCH(\"Surveys with experts/expert opinion\",'Data extraction-synthesis'!J25)),\"X\",\"\")","v":""},{"$f":"IF(ISNUMBER(SEARCH(\"Consensus meeting inputs\",'Data extraction-synthesis'!J25)),\"X\",\"\")","v":""},{"$f":"IF(ISNUMBER(SEARCH(\"Available data\",'Data extraction-synthesis'!J25)),\"X\",\"\")","v":""},{"$f":"IF(ISNUMBER(SEARCH(\"Field observations\",'Data extraction-synthesis'!J25)),\"X\",\"\")","v":""},{"$f":"IF(ISNUMBER(SEARCH(\"Laboratory evaluations\",'Data extraction-synthesis'!J25)),\"X\",\"\")","v":""},{"$f":"IF(ISNUMBER(SEARCH(\"Models\",'Data extraction-synthesis'!J25)),\"X\",\"\")","v":""},{"$f":"IF(ISNUMBER(SEARCH(\"Early usability studies\",'Data extraction-synthesis'!J25)),\"X\",\"\")","v":""},{"$f":"IF(ISNUMBER(SEARCH(\"No input sources reported\",'Data extraction-synthesis'!J25)),\"X\",\"\")","v":""},{"$f":"IF(ISNUMBER(SEARCH(\"N/A\",'Data extraction-synthesis'!J25)),\"X\",\"\")","v":"X"},"N/A"]
["WHO","Specifications for a rapid diagnostic test for meningitis African meningitis belt/ Target product profile for the development of a new generation of rapid test for the diagnosis of bacterial meningitis",{"$f":"IF(ISNUMBER(SEARCH(\"Literature\",'Data extraction-synthesis'!J26)),\"X\",\"\")","v":""},{"$f":"IF(ISNUMBER(SEARCH(\"Industry standard\",'Data extraction-synthesis'!J26)),\"X\",\"\")","v":""},{"$f":"IF(ISNUMBER(SEARCH(\"Guidelines\",'Data extraction-synthesis'!J26)),\"X\",\"\")","v":""},{"$f":"IF(ISNUMBER(SEARCH(\"Interviews with experts\",'Data extraction-synthesis'!J26)),\"X\",\"\")","v":""},{"$f":"IF(ISNUMBER(SEARCH(\"Surveys with experts/expert opinion\",'Data extraction-synthesis'!J26)),\"X\",\"\")","v":""},{"$f":"IF(ISNUMBER(SEARCH(\"Consensus meeting inputs\",'Data extraction-synthesis'!J26)),\"X\",\"\")","v":""},{"$f":"IF(ISNUMBER(SEARCH(\"Available data\",'Data extraction-synthesis'!J26)),\"X\",\"\")","v":""},{"$f":"IF(ISNUMBER(SEARCH(\"Field observations\",'Data extraction-synthesis'!J26)),\"X\",\"\")","v":""},{"$f":"IF(ISNUMBER(SEARCH(\"Laboratory evaluations\",'Data extraction-synthesis'!J26)),\"X\",\"\")","v":""},{"$f":"IF(ISNUMBER(SEARCH(\"Models\",'Data extraction-synthesis'!J26)),\"X\",\"\")","v":""},{"$f":"IF(ISNUMBER(SEARCH(\"Early usability studies\",'Data extraction-synthesis'!J26)),\"X\",\"\")","v":""},{"$f":"IF(ISNUMBER(SEARCH(\"No input sources reported\",'Data extraction-synthesis'!J26)),\"X\",\"\")","v":"X"},{"$f":"IF(ISNUMBER(SEARCH(\"N/A\",'Data extraction-synthesis'!J26)),\"X\",\"\")","v":""},"N/A"]
["WHO","Target Product Profile for Zaire ebolavirus rapid,simple test to be used in the control of the Ebola outbreak in West Africa",{"$f":"IF(ISNUMBER(SEARCH(\"Literature\",'Data extraction-synthesis'!J27)),\"X\",\"\")","v":""},{"$f":"IF(ISNUMBER(SEARCH(\"Industry standard\",'Data extraction-synthesis'!J27)),\"X\",\"\")","v":""},{"$f":"IF(ISNUMBER(SEARCH(\"Guidelines\",'Data extraction-synthesis'!J27)),\"X\",\"\")","v":""},{"$f":"IF(ISNUMBER(SEARCH(\"Interviews with experts\",'Data extraction-synthesis'!J27)),\"X\",\"\")","v":""},{"$f":"IF(ISNUMBER(SEARCH(\"Surveys with experts/expert opinion\",'Data extraction-synthesis'!J27)),\"X\",\"\")","v":""},{"$f":"IF(ISNUMBER(SEARCH(\"Consensus meeting inputs\",'Data extraction-synthesis'!J27)),\"X\",\"\")","v":""},{"$f":"IF(ISNUMBER(SEARCH(\"Available data\",'Data extraction-synthesis'!J27)),\"X\",\"\")","v":""},{"$f":"IF(ISNUMBER(SEARCH(\"Field observations\",'Data extraction-synthesis'!J27)),\"X\",\"\")","v":""},{"$f":"IF(ISNUMBER(SEARCH(\"Laboratory evaluations\",'Data extraction-synthesis'!J27)),\"X\",\"\")","v":""},{"$f":"IF(ISNUMBER(SEARCH(\"Models\",'Data extraction-synthesis'!J27)),\"X\",\"\")","v":""},{"$f":"IF(ISNUMBER(SEARCH(\"Early usability studies\",'Data extraction-synthesis'!J27)),\"X\",\"\")","v":""},{"$f":"IF(ISNUMBER(SEARCH(\"No input sources reported\",'Data extraction-synthesis'!J27)),\"X\",\"\")","v":"X"},{"$f":"IF(ISNUMBER(SEARCH(\"N/A\",'Data extraction-synthesis'!J27)),\"X\",\"\")","v":""},"N/A"]
["WHO","Report of WHO-FIND meeting on diagnostics for Buruli ulcer",{"$f":"IF(ISNUMBER(SEARCH(\"Literature\",'Data extraction-synthesis'!J28)),\"X\",\"\")","v":""},{"$f":"IF(ISNUMBER(SEARCH(\"Industry standard\",'Data extraction-synthesis'!J28)),\"X\",\"\")","v":""},{"$f":"IF(ISNUMBER(SEARCH(\"Guidelines\",'Data extraction-synthesis'!J28)),\"X\",\"\")","v":""},{"$f":"IF(ISNUMBER(SEARCH(\"Interviews with experts\",'Data extraction-synthesis'!J28)),\"X\",\"\")","v":""},{"$f":"IF(ISNUMBER(SEARCH(\"Surveys with experts/expert opinion\",'Data extraction-synthesis'!J28)),\"X\",\"\")","v":""},{"$f":"IF(ISNUMBER(SEARCH(\"Consensus meeting inputs\",'Data extraction-synthesis'!J28)),\"X\",\"\")","v":""},{"$f":"IF(ISNUMBER(SEARCH(\"Available data\",'Data extraction-synthesis'!J28)),\"X\",\"\")","v":""},{"$f":"IF(ISNUMBER(SEARCH(\"Field observations\",'Data extraction-synthesis'!J28)),\"X\",\"\")","v":""},{"$f":"IF(ISNUMBER(SEARCH(\"Laboratory evaluations\",'Data extraction-synthesis'!J28)),\"X\",\"\")","v":""},{"$f":"IF(ISNUMBER(SEARCH(\"Models\",'Data extraction-synthesis'!J28)),\"X\",\"\")","v":""},{"$f":"IF(ISNUMBER(SEARCH(\"Early usability studies\",'Data extraction-synthesis'!J28)),\"X\",\"\")","v":""},{"$f":"IF(ISNUMBER(SEARCH(\"No input sources reported\",'Data extraction-synthesis'!J28)),\"X\",\"\")","v":""},{"$f":"IF(ISNUMBER(SEARCH(\"N/A\",'Data extraction-synthesis'!J28)),\"X\",\"\")","v":"X"},"N/A"]
["WHO","Taenia solium taeniasis/cysticercosis diagnostic tools. Report of a stakeholder meeting",{"$f":"IF(ISNUMBER(SEARCH(\"Literature\",'Data extraction-synthesis'!J29)),\"X\",\"\")","v":""},{"$f":"IF(ISNUMBER(SEARCH(\"Industry standard\",'Data extraction-synthesis'!J29)),\"X\",\"\")","v":""},{"$f":"IF(ISNUMBER(SEARCH(\"Guidelines\",'Data extraction-synthesis'!J29)),\"X\",\"\")","v":""},{"$f":"IF(ISNUMBER(SEARCH(\"Interviews with experts\",'Data extraction-synthesis'!J29)),\"X\",\"\")","v":""},{"$f":"IF(ISNUMBER(SEARCH(\"Surveys with experts/expert opinion\",'Data extraction-synthesis'!J29)),\"X\",\"\")","v":""},{"$f":"IF(ISNUMBER(SEARCH(\"Consensus meeting inputs\",'Data extraction-synthesis'!J29)),\"X\",\"\")","v":""},{"$f":"IF(ISNUMBER(SEARCH(\"Available data\",'Data extraction-synthesis'!J29)),\"X\",\"\")","v":""},{"$f":"IF(ISNUMBER(SEARCH(\"Field observations\",'Data extraction-synthesis'!J29)),\"X\",\"\")","v":""},{"$f":"IF(ISNUMBER(SEARCH(\"Laboratory evaluations\",'Data extraction-synthesis'!J29)),\"X\",\"\")","v":""},{"$f":"IF(ISNUMBER(SEARCH(\"Models\",'Data extraction-synthesis'!J29)),\"X\",\"\")","v":""},{"$f":"IF(ISNUMBER(SEARCH(\"Early usability studies\",'Data extraction-synthesis'!J29)),\"X\",\"\")","v":""},{"$f":"IF(ISNUMBER(SEARCH(\"No input sources reported\",'Data extraction-synthesis'!J29)),\"X\",\"\")","v":""},{"$f":"IF(ISNUMBER(SEARCH(\"N/A\",'Data extraction-synthesis'!J29)),\"X\",\"\")","v":"X"},"N/A"]
["WHO, FIND, Medecins sans Frontiers","A Multiplex Multi-Analyte Diagnostic Platform",{"$f":"IF(ISNUMBER(SEARCH(\"Literature\",'Data extraction-synthesis'!J45)),\"X\",\"\")","v":""},{"$f":"IF(ISNUMBER(SEARCH(\"Industry standard\",'Data extraction-synthesis'!J45)),\"X\",\"\")","v":""},{"$f":"IF(ISNUMBER(SEARCH(\"Guidelines\",'Data extraction-synthesis'!J45)),\"X\",\"\")","v":""},{"$f":"IF(ISNUMBER(SEARCH(\"Interviews with experts\",'Data extraction-synthesis'!J45)),\"X\",\"\")","v":""},{"$f":"IF(ISNUMBER(SEARCH(\"Surveys with experts/expert opinion\",'Data extraction-synthesis'!J45)),\"X\",\"\")","v":""},{"$f":"IF(ISNUMBER(SEARCH(\"Consensus meeting inputs\",'Data extraction-synthesis'!J45)),\"X\",\"\")","v":""},{"$f":"IF(ISNUMBER(SEARCH(\"Available data\",'Data extraction-synthesis'!J45)),\"X\",\"\")","v":""},{"$f":"IF(ISNUMBER(SEARCH(\"Field observations\",'Data extraction-synthesis'!J45)),\"X\",\"\")","v":""},{"$f":"IF(ISNUMBER(SEARCH(\"Laboratory evaluations\",'Data extraction-synthesis'!J45)),\"X\",\"\")","v":""},{"$f":"IF(ISNUMBER(SEARCH(\"Models\",'Data extraction-synthesis'!J45)),\"X\",\"\")","v":""},{"$f":"IF(ISNUMBER(SEARCH(\"Early usability studies\",'Data extraction-synthesis'!J45)),\"X\",\"\")","v":""},{"$f":"IF(ISNUMBER(SEARCH(\"No input sources reported\",'Data extraction-synthesis'!J45)),\"X\",\"\")","v":"X"},{"$f":"IF(ISNUMBER(SEARCH(\"N/A\",'Data extraction-synthesis'!J45)),\"X\",\"\")","v":""},"N/A"]
[null,"TOT",{"$f":"COUNTIF(C3:C46,\"X\")","v":12},0,0,0,4,0,2,0,1,2,1,18,9]
[null,null,{"$f":"C47/44","v":{"v":0.2727272727272727,"d":"27%"}},{"v":0,"d":"0%"},{"v":0,"d":"0%"},{"v":0,"d":"0%"},{"v":0.09090909090909091,"d":"9%"},{"v":0,"d":"0%"},{"v":0.045454545454545456,"d":"5%"},{"v":0,"d":"0%"},{"v":0.022727272727272728,"d":"2%"},{"v":0.045454545454545456,"d":"5%"},{"v":0.022727272727272728,"d":"2%"},{"v":0.4090909090909091,"d":"41%"},{"v":0.20454545454545456,"d":"20%"}]

{"sheet":"Input source diagn accuracy","index":4,"n_rows":56,"n_cols":20,"rows_kept":56,"merged":[[0,2,0,14],[53,2,53,14]]}
[null,null,"Input source to populate diagnostic accuracy"]
["Authors","Article title","Literature","Industry standard","Guidelines","Interviews with experts","Surveys with experts/expert opinion","Consensus meeting inputs","Available data","Field observations","Laboratory evaluations","Models ","Early usability studies ","No input sources reported","N/A (no reference to specific literature)",null,null,"More than 1 input source?","% STUDIES WITH 1 INPUT SOURCE","% STUDIES WITH >1 INPUT SOURCE"]
["Chua, A. P., I.: Nuebling, C. M.: Wood, D.: Moussy, F.","Update on Zika Diagnostic Tests and WHO's Related Activities",{"$f":"IF(ISNUMBER(SEARCH(\"Literature\",'Data extraction-synthesis'!J2)),\"X\",\"\")","v":""},{"$f":"IF(ISNUMBER(SEARCH(\"Industry standard\",'Data extraction-synthesis'!J2)),\"X\",\"\")","v":""},{"$f":"IF(ISNUMBER(SEARCH(\"Guidelines\",'Data extraction-synthesis'!J2)),\"X\",\"\")","v":""},{"$f":"IF(ISNUMBER(SEARCH(\"Interviews with experts\",'Data extraction-synthesis'!J2)),\"X\",\"\")","v":""},{"$f":"IF(ISNUMBER(SEARCH(\"Surveys with experts/expert opinion\",'Data extraction-synthesis'!J2)),\"X\",\"\")","v":""},{"$f":"IF(ISNUMBER(SEARCH(\"Consensus meeting inputs\",'Data extraction-synthesis'!J2)),\"X\",\"\")","v":""},{"$f":"IF(ISNUMBER(SEARCH(\"Available data\",'Data extraction-synthesis'!J2)),\"X\",\"\")","v":""},{"$f":"IF(ISNUMBER(SEARCH(\"Field observations\",'Data extraction-synthesis'!J2)),\"X\",\"\")","v":""},{"$f":"IF(ISNUMBER(SEARCH(\"Laboratory evaluations\",'Data extraction-synthesis'!J2)),\"X\",\"\")","v":""},{"$f":"IF(ISNUMBER(SEARCH(\"Models\",'Data extraction-synthesis'!J2)),\"X\",\"\")","v":""},{"$f":"IF(ISNUMBER(SEARCH(\"Early usability studies\",'Data extraction-synthesis'!J2)),\"X\",\"\")","v":""},{"$f":"IF(ISNUMBER(SEARCH(\"No input sources reported\",'Data extraction-synthesis'!J2)),\"X\",\"\")","v":"X"},{"$f":"IF(ISNUMBER(SEARCH(\"N/A\",'Data extraction-synthesis'!J2)),\"X\",\"\")","v":""},null,null,{"$f":"IF(OR(O3=\"X\",N3=\"X\"),\"N/A\",IF((COUNTIF(C3:O3,\"X\"))>1,\"YES\",\"NO\"))","v":"N/A"},{"$f":"COUNTIF(R3:R46,\"NO\")/44","v":{"v":0.22727272727272727,"d":"23%"}},{"$f":"COUNTIF(R3:R46,\"YES\")/44","v":{"v":0.18181818181818182,"d":"18%"}}]
["Denkinger, C. M. D., D.: Schito, M.: Wells, W.: Cobelens, F.: Pai, M.: Zignol, M.: Cirillo, D. M.: Alland, D.: Casenghi, M.: Gallarda, J.: Boehme, C. C.: Perkins, M. D","Target Product Profile of a Molecular Drug-Susceptibility Test for Use in Microscopy Centers",{"$f":"IF(ISNUMBER(SEARCH(\"Literature\",'Data extraction-synthesis'!J3)),\"X\",\"\")","v":"X"},{"$f":"IF(ISNUMBER(SEARCH(\"Industry standard\",'Data extraction-synthesis'!J3)),\"X\",\"\")","v":""},{"$f":"IF(ISNUMBER(SEARCH(\"Guidelines\",'Data extraction-synthesis'!J3)),\"X\",\"\")","v":""},{"$f":"IF(ISNUMBER(SEARCH(\"Interviews with experts\",'Data extraction-synthesis'!J3)),\"X\",\"\")","v":""},{"$f":"IF(ISNUMBER(SEARCH(\"Surveys with experts/expert opinion\",'Data extraction-synthesis'!J3)),\"X\",\"\")","v":""},{"$f":"IF(ISNUMBER(SEARCH(\"Consensus meeting inputs\",'Data extraction-synthesis'!J3)),\"X\",\"\")","v":""},{"$f":"IF(ISNUMBER(SEARCH(\"Available data\",'Data extraction-synthesis'!J3)),\"X\",\"\")","v":""},{"$f":"IF(ISNUMBER(SEARCH(\"Field observations\",'Data extraction-synthesis'!J3)),\"X\",\"\")","v":""},{"$f":"IF(ISNUMBER(SEARCH(\"Laboratory evaluations\",'Data extraction-synthesis'!J3)),\"X\",\"\")","v":""},{"$f":"IF(ISNUMBER(SEARCH(\"Models\",'Data extraction-synthesis'!J3)),\"X\",\"\")","v":"X"},{"$f":"IF(ISNUMBER(SEARCH(\"Early usability studies\",'Data extraction-synthesis'!J3)),\"X\",\"\")","v":""},{"$f":"IF(ISNUMBER(SEARCH(\"No input sources reported\",'Data extraction-synthesis'!J3)),\"X\",\"\")","v":""},{"$f":"IF(ISNUMBER(SEARCH(\"N/A\",'Data extraction-synthesis'!J3)),\"X\",\"\")","v":""},null,null,"YES"]
["Denkinger, C. M. K., Sandra V.: Cirillo, Daniela Maria: Casenghi, Martina: Shinnick, Thomas: Weyer, Karin: Gilpin, Chris: Boehme, Catharina C.: Schito, Marco: Kimerling, Michael: Pai, Madhuka","Defining the needs for next generation assays for tuberculosis",{"$f":"IF(ISNUMBER(SEARCH(\"Literature\",'Data extraction-synthesis'!J4)),\"X\",\"\")","v":"X"},{"$f":"IF(ISNUMBER(SEARCH(\"Industry standard\",'Data extraction-synthesis'!J4)),\"X\",\"\")","v":""},{"$f":"IF(ISNUMBER(SEARCH(\"Guidelines\",'Data extraction-synthesis'!J4)),\"X\",\"\")","v":""},{"$f":"IF(ISNUMBER(SEARCH(\"Interviews with experts\",'Data extraction-synthesis'!J4)),\"X\",\"\")","v":""},{"$f":"IF(ISNUMBER(SEARCH(\"Surveys with experts/expert opinion\",'Data extraction-synthesis'!J4)),\"X\",\"\")","v":""},{"$f":"IF(ISNUMBER(SEARCH(\"Consensus meeting inputs\",'Data extraction-synthesis'!J4)),\"X\",\"\")","v":""},{"$f":"IF(ISNUMBER(SEARCH(\"Available data\",'Data extraction-synthesis'!J4)),\"X\",\"\")","v":""},{"$f":"IF(ISNUMBER(SEARCH(\"Field observations\",'Data extraction-synthesis'!J4)),\"X\",\"\")","v":""},{"$f":"IF(ISNUMBER(SEARCH(\"Laboratory evaluations\",'Data extraction-synthesis'!J4)),\"X\",\"\")","v":""},{"$f":"IF(ISNUMBER(SEARCH(\"Models\",'Data extraction-synthesis'!J4)),\"X\",\"\")","v":"X"},{"$f":"IF(ISNUMBER(SEARCH(\"Early usability studies\",'Data extraction-synthesis'!J4)),\"X\",\"\")","v":""},{"$f":"IF(ISNUMBER(SEARCH(\"No input sources reported\",'Data extraction-synthesis'!J4)),\"X\",\"\")","v":""},{"$f":"IF(ISNUMBER(SEARCH(\"N/A\",'Data extraction-synthesis'!J4)),\"X\",\"\")","v":""},null,null,"YES"]
["DIAMETER Project, PATH","Point-of-Care Malaria Infection Detection Test For rapid detection of low-density, subclinical malaria infections",null,{"$f":"IF(ISNUMBER(SEARCH(\"Industry standard\",'Data extraction-synthesis'!J5)),\"X\",\"\")","v":""},{"$f":"IF(ISNUMBER(SEARCH(\"Guidelines\",'Data extraction-synthesis'!J5)),\"X\",\"\")","v":""},{"$f":"IF(ISNUMBER(SEARCH(\"Interviews with experts\",'Data extraction-synthesis'!J5)),\"X\",\"\")","v":""},null,{"$f":"IF(ISNUMBER(SEARCH(\"Consensus meeting inputs\",'Data extraction-synthesis'!J5)),\"X\",\"\")","v":""},{"$f":"IF(ISNUMBER(SEARCH(\"Available data\",'Data extraction-synthesis'!J5)),\"X\",\"\")","v":""},{"$f":"IF(ISNUMBER(SEARCH(\"Field observations\",'Data extraction-synthesis'!J5)),\"X\",\"\")","v":""},{"$f":"IF(ISNUMBER(SEARCH(\"Laboratory evaluations\",'Data extraction-synthesis'!J5)),\"X\",\"\")","v":""},{"$f":"IF(ISNUMBER(SEARCH(\"Models\",'Data extraction-synthesis'!J5)),\"X\",\"\")","v":""},{"$f":"IF(ISNUMBER(SEARCH(\"Early usability studies\",'Data extraction-synthesis'!J5)),\"X\",\"\")","v":""},"x",{"$f":"IF(ISNUMBER(SEARCH(\"N/A\",'Data extraction-synthesis'!J5)),\"X\",\"\")","v":""},null,null,"N/A"]
["Ding, X. C. A., Maria Paz: Baird, J. Kevin: Cheng, Qin: Cunningham, Jane: Dhorda, Mehul: Drakeley, Chris: Felger, Ingrid: Gamboa, Dionicia: Harbers, Matthias: Herrera, Socrates: Lucchi, Naomi: Mayor, Alfredo: Mueller, Ivo: Sattabongkot, Jetsumon: Ratsimbason, Arsène: Richards, Jack: Tanner, Marcel: González, Iveth J.","Defining the next generation of Plasmodium vivax diagnostic tests for control and elimination: Target product profiles",{"$f":"IF(ISNUMBER(SEARCH(\"Literature\",'Data extraction-synthesis'!J6)),\"X\",\"\")","v":"X"},{"$f":"IF(ISNUMBER(SEARCH(\"Industry standard\",'Data extraction-synthesis'!J6)),\"X\",\"\")","v":""},{"$f":"IF(ISNUMBER(SEARCH(\"Guidelines\",'Data extraction-synthesis'!J6)),\"X\",\"\")","v":""},{"$f":"IF(ISNUMBER(SEARCH(\"Interviews with experts\",'Data extraction-synthesis'!J6)),\"X\",\"\")","v":""},{"$f":"IF(ISNUMBER(SEARCH(\"Surveys with experts/expert opinion\",'Data extraction-synthesis'!J6)),\"X\",\"\")","v":""},{"$f":"IF(ISNUMBER(SEARCH(\"Consensus meeting inputs\",'Data extraction-synthesis'!J6)),\"X\",\"\")","v":""},{"$f":"IF(ISNUMBER(SEARCH(\"Available data\",'Data extraction-synthesis'!J6)),\"X\",\"\")","v":""},{"$f":"IF(ISNUMBER(SEARCH(\"Field observations\",'Data extraction-synthesis'!J6)),\"X\",\"\")","v":""},{"$f":"IF(ISNUMBER(SEARCH(\"Laboratory evaluations\",'Data extraction-synthesis'!J6)),\"X\",\"\")","v":""},null,{"$f":"IF(ISNUMBER(SEARCH(\"Early usability studies\",'Data extraction-synthesis'!J6)),\"X\",\"\")","v":""},{"$f":"IF(ISNUMBER(SEARCH(\"No input sources reported\",'Data extraction-synthesis'!J6)),\"X\",\"\")","v":""},{"$f":"IF(ISNUMBER(SEARCH(\"N/A\",'Data extraction-synthesis'!J6)),\"X\",\"\")","v":""},null,null,"NO"]
["Dittrich, S. T., B. T.: Moussy, F.: Chua, A.: Zorzet, A.: Tangden, T.: Dolinger, D. L.: Page, A. L.: Crump, J. A.: Valerie, D.: Bassat, Q.: Lubell, Y.: Heinrich, N.: Newton, P. N.: Rodwell, T.: Gonzalez, I. J.","Target Product Profile for a Diagnostic Assay to Differentiate between Bacterial and Non-Bacterial Infections to Guide Antimicrobials Use in Resource-Limited Settings: An Expert Consensus",{"$f":"IF(ISNUMBER(SEARCH(\"Literature\",'Data extraction-synthesis'!J7)),\"X\",\"\")","v":""},{"$f":"IF(ISNUMBER(SEARCH(\"Industry standard\",'Data extraction-synthesis'!J7)),\"X\",\"\")","v":""},{"$f":"IF(ISNUMBER(SEARCH(\"Guidelines\",'Data extraction-synthesis'!J7)),\"X\",\"\")","v":""},{"$f":"IF(ISNUMBER(SEARCH(\"Interviews with experts\",'Data extraction-synthesis'!J7)),\"X\",\"\")","v":""},{"$f":"IF(ISNUMBER(SEARCH(\"Surveys with experts/expert opinion\",'Data extraction-synthesis'!J7)),\"X\",\"\")","v":"X"},{"$f":"IF(ISNUMBER(SEARCH(\"Consensus meeting inputs\",'Data extraction-synthesis'!J7)),\"X\",\"\")","v":""},{"$f":"IF(ISNUMBER(SEARCH(\"Available data\",'Data extraction-synthesis'!J7)),\"X\",\"\")","v":""},{"$f":"IF(ISNUMBER(SEARCH(\"Field observations\",'Data extraction-synthesis'!J7)),\"X\",\"\")","v":""},{"$f":"IF(ISNUMBER(SEARCH(\"Laboratory evaluations\",'Data extraction-synthesis'!J7)),\"X\",\"\")","v":""},{"$f":"IF(ISNUMBER(SEARCH(\"Models\",'Data extraction-synthesis'!J7)),\"X\",\"\")","v":""},{"$f":"IF(ISNUMBER(SEARCH(\"Early usability studies\",'Data extraction-synthesis'!J7)),\"X\",\"\")","v":""},{"$f":"IF(ISNUMBER(SEARCH(\"No input sources reported\",'Data extraction-synthesis'!J7)),\"X\",\"\")","v":""},{"$f":"IF(ISNUMBER(SEARCH(\"N/A\",'Data extraction-synthesis'!J7)),\"X\",\"\")","v":""},null,null,"NO"]
["Donadeu, M. F., A. S.: Olliaro, P. L.: Abela-Ridder, B","Target product profiles for the diagnosis of Taenia solium taeniasis, neurocysticercosis and porcine cysticercosis",{"$f":"IF(ISNUMBER(SEARCH(\"Literature\",'Data extraction-synthesis'!J16)),\"X\",\"\")","v":"X"},{"$f":"IF(ISNUMBER(SEARCH(\"Industry standard\",'Data extraction-synthesis'!J16)),\"X\",\"\")","v":""},{"$f":"IF(ISNUMBER(SEARCH(\"Guidelines\",'Data extraction-synthesis'!J16)),\"X\",\"\")","v":""},{"$f":"IF(ISNUMBER(SEARCH(\"Interviews with experts\",'Data extraction-synthesis'!J16)),\"X\",\"\")","v":""},{"$f":"IF(ISNUMBER(SEARCH(\"Surveys with experts/expert opinion\",'Data extraction-synthesis'!J16)),\"X\",\"\")","v":"X"},{"$f":"IF(ISNUMBER(SEARCH(\"Consensus meeting inputs\",'Data extraction-synthesis'!J16)),\"X\",\"\")","v":""},{"$f":"IF(ISNUMBER(SEARCH(\"Available data\",'Data extraction-synthesis'!J16)),\"X\",\"\")","v":""},{"$f":"IF(ISNUMBER(SEARCH(\"Field observations\",'Data extraction-synthesis'!J16)),\"X\",\"\")","v":""},{"$f":"IF(ISNUMBER(SEARCH(\"Laboratory evaluations\",'Data extraction-synthesis'!J16)),\"X\",\"\")","v":""},{"$f":"IF(ISNUMBER(SEARCH(\"Models\",'Data extraction-synthesis'!J16)),\"X\",\"\")","v":""},{"$f":"IF(ISNUMBER(SEARCH(\"Early usability studies\",'Data extraction-synthesis'!J16)),\"X\",\"\")","v":""},{"$f":"IF(ISNUMBER(SEARCH(\"No input sources reported\",'Data extraction-synthesis'!J16)),\"X\",\"\")","v":""},{"$f":"IF(ISNUMBER(SEARCH(\"N/A\",'Data extraction-synthesis'!J16)),\"X\",\"\")","v":""},null,null,"YES"]
["Ebels, K. B. C., C.: Crudder, C. H.: McGray, S.: Magnuson, K.: Tietje, K.: Labarre, P","Incorporating user needs into product development for improved infection detection for malaria elimination programs",{"$f":"IF(ISNUMBER(SEARCH(\"Literature\",'Data extraction-synthesis'!J40)),\"X\",\"\")","v":""},{"$f":"IF(ISNUMBER(SEARCH(\"Industry standard\",'Data extraction-synthesis'!J40)),\"X\",\"\")","v":""},{"$f":"IF(ISNUMBER(SEARCH(\"Guidelines\",'Data extraction-synthesis'!J40)),\"X\",\"\")","v":""},{"$f":"IF(ISNUMBER(SEARCH(\"Interviews with experts\",'Data extraction-synthesis'!J40)),\"X\",\"\")","v":""},{"$f":"IF(ISNUMBER(SEARCH(\"Surveys with experts/expert opinion\",'Data extraction-synthesis'!J40)),\"X\",\"\")","v":""},{"$f":"IF(ISNUMBER(SEARCH(\"Consensus meeting inputs\",'Data extraction-synthesis'!J40)),\"X\",\"\")","v":""},{"$f":"IF(ISNUMBER(SEARCH(\"Available data\",'Data extraction-synthesis'!J40)),\"X\",\"\")","v":""},{"$f":"IF(ISNUMBER(SEARCH(\"Field observations\",'Data extraction-synthesis'!J40)),\"X\",\"\")","v":""},{"$f":"IF(ISNUMBER(SEARCH(\"Laboratory evaluations\",'Data extraction-synthesis'!J40)),\"X\",\"\")","v":""},{"$f":"IF(ISNUMBER(SEARCH(\"Models\",'Data extraction-synthesis'!J40)),\"X\",\"\")","v":""},{"$f":"IF(ISNUMBER(SEARCH(\"Early usability studies\",'Data extraction-synthesis'!J40)),\"X\",\"\")","v":""},{"$f":"IF(ISNUMBER(SEARCH(\"No input sources reported\",'Data extraction-synthesis'!J40)),\"X\",\"\")","v":""},{"$f":"IF(ISNUMBER(SEARCH(\"N/A\",'Data extraction-synthesis'!J40)),\"X\",\"\")","v":"X"},null,null,"N/A"]
["FIND","Target Product Profile for Tests for Recent HIV Infection",{"$f":"IF(ISNUMBER(SEARCH(\"Literature\",'Data extraction-synthesis'!J17)),\"X\",\"\")","v":""},{"$f":"IF(ISNUMBER(SEARCH(\"Industry standard\",'Data extraction-synthesis'!J17)),\"X\",\"\")","v":""},{"$f":"IF(ISNUMBER(SEARCH(\"Guidelines\",'Data extraction-synthesis'!J17)),\"X\",\"\")","v":""},{"$f":"IF(ISNUMBER(SEARCH(\"Interviews with experts\",'Data extraction-synthesis'!J17)),\"X\",\"\")","v":""},{"$f":"IF(ISNUMBER(SEARCH(\"Surveys with experts/expert opinion\",'Data extraction-synthesis'!J17)),\"X\",\"\")","v":""},{"$f":"IF(ISNUMBER(SEARCH(\"Consensus meeting inputs\",'Data extraction-synthesis'!J17)),\"X\",\"\")","v":""},{"$f":"IF(ISNUMBER(SEARCH(\"Available data\",'Data extraction-synthesis'!J17)),\"X\",\"\")","v":""},{"$f":"IF(ISNUMBER(SEARCH(\"Field observations\",'Data extraction-synthesis'!J17)),\"X\",\"\")","v":""},{"$f":"IF(ISNUMBER(SEARCH(\"Laboratory evaluations\",'Data extraction-synthesis'!J17)),\"X\",\"\")","v":""},{"$f":"IF(ISNUMBER(SEARCH(\"Models\",'Data extraction-synthesis'!J17)),\"X\",\"\")","v":""},{"$f":"IF(ISNUMBER(SEARCH(\"Early usability studies\",'Data extraction-synthesis'!J17)),\"X\",\"\")","v":""},{"$f":"IF(ISNUMBER(SEARCH(\"No input sources reported\",'Data extraction-synthesis'!J17)),\"X\",\"\")","v":"X"},{"$f":"IF(ISNUMBER(SEARCH(\"N/A\",'Data extraction-synthesis'!J17)),\"X\",\"\")","v":""},null,null,"N/A"]
["FIND","Target Product Profile: Rapid test for diagnosis of malaria and screening for hyman African trypanosomiasis (HAT)",{"$f":"IF(ISNUMBER(SEARCH(\"Literature\",'Data extraction-synthesis'!J18)),\"X\",\"\")","v":""},{"$f":"IF(ISNUMBER(SEARCH(\"Industry standard\",'Data extraction-synthesis'!J18)),\"X\",\"\")","v":""},{"$f":"IF(ISNUMBER(SEARCH(\"Guidelines\",'Data extraction-synthesis'!J18)),\"X\",\"\")","v":""},{"$f":"IF(ISNUMBER(SEARCH(\"Interviews with experts\",'Data extraction-synthesis'!J18)),\"X\",\"\")","v":""},{"$f":"IF(ISNUMBER(SEARCH(\"Surveys with experts/expert opinion\",'Data extraction-synthesis'!J18)),\"X\",\"\")","v":""},{"$f":"IF(ISNUMBER(SEARCH(\"Consensus meeting inputs\",'Data extraction-synthesis'!J18)),\"X\",\"\")","v":""},{"$f":"IF(ISNUMBER(SEARCH(\"Available data\",'Data extraction-synthesis'!J18)),\"X\",\"\")","v":""},{"$f":"IF(ISNUMBER(SEARCH(\"Field observations\",'Data extraction-synthesis'!J18)),\"X\",\"\")","v":""},{"$f":"IF(ISNUMBER(SEARCH(\"Laboratory evaluations\",'Data extraction-synthesis'!J18)),\"X\",\"\")","v":""},{"$f":"IF(ISNUMBER(SEARCH(\"Models\",'Data extraction-synthesis'!J18)),\"X\",\"\")","v":""},{"$f":"IF(ISNUMBER(SEARCH(\"Early usability studies\",'Data extraction-synthesis'!J18)),\"X\",\"\")","v":""},{"$f":"IF(ISNUMBER(SEARCH(\"No input sources reported\",'Data extraction-synthesis'!J18)),\"X\",\"\")","v":"X"},{"$f":"IF(ISNUMBER(SEARCH(\"N/A\",'Data extraction-synthesis'!J18)),\"X\",\"\")","v":""},null,null,"N/A"]
["FIND","Target Product Profile: Screening test for human African trypanosomiasis (HAT)",{"$f":"IF(ISNUMBER(SEARCH(\"Literature\",'Data extraction-synthesis'!J41)),\"X\",\"\")","v":""},{"$f":"IF(ISNUMBER(SEARCH(\"Industry standard\",'Data extraction-synthesis'!J41)),\"X\",\"\")","v":""},{"$f":"IF(ISNUMBER(SEARCH(\"Guidelines\",'Data extraction-synthesis'!J41)),\"X\",\"\")","v":""},{"$f":"IF(ISNUMBER(SEARCH(\"Interviews with experts\",'Data extraction-synthesis'!J41)),\"X\",\"\")","v":""},{"$f":"IF(ISNUMBER(SEARCH(\"Surveys with experts/expert opinion\",'Data extraction-synthesis'!J41)),\"X\",\"\")","v":""},{"$f":"IF(ISNUMBER(SEARCH(\"Consensus meeting inputs\",'Data extraction-synthesis'!J41)),\"X\",\"\")","v":""},{"$f":"IF(ISNUMBER(SEARCH(\"Available data\",'Data extraction-synthesis'!J41)),\"X\",\"\")","v":""},{"$f":"IF(ISNUMBER(SEARCH(\"Field observations\",'Data extraction-synthesis'!J41)),\"X\",\"\")","v":""},{"$f":"IF(ISNUMBER(SEARCH(\"Laboratory evaluations\",'Data extraction-synthesis'!J41)),\"X\",\"\")","v":""},{"$f":"IF(ISNUMBER(SEARCH(\"Models\",'Data extraction-synthesis'!J41)),\"X\",\"\")","v":""},{"$f":"IF(ISNUMBER(SEARCH(\"Early usability studies\",'Data extraction-synthesis'!J41)),\"X\",\"\")","v":""},{"$f":"IF(ISNUMBER(SEARCH(\"No input sources reported\",'Data extraction-synthesis'!J41)),\"X\",\"\")","v":"X"},{"$f":"IF(ISNUMBER(SEARCH(\"N/A\",'Data extraction-synthesis'!J41)),\"X\",\"\")","v":""},null,null,"N/A"]
["FIND","High-priority target product profile for hepatitis C diagnosis in decentralized settings: Report of a consensus meeting. ","x",{"$f":"IF(ISNUMBER(SEARCH(\"Industry standard\",'Data extraction-synthesis'!J8)),\"X\",\"\")","v":""},{"$f":"IF(ISNUMBER(SEARCH(\"Guidelines\",'Data extraction-synthesis'!J8)),\"X\",\"\")","v":""},{"$f":"IF(ISNUMBER(SEARCH(\"Interviews with experts\",'Data extraction-synthesis'!J8)),\"X\",\"\")","v":""},{"$f":"IF(ISNUMBER(SEARCH(\"Surveys with experts/expert opinion\",'Data extraction-synthesis'!J8)),\"X\",\"\")","v":"X"},{"$f":"IF(ISNUMBER(SEARCH(\"Consensus meeting inputs\",'Data extraction-synthesis'!J8)),\"X\",\"\")","v":""},null,{"$f":"IF(ISNUMBER(SEARCH(\"Field observations\",'Data extraction-synthesis'!J8)),\"X\",\"\")","v":""},{"$f":"IF(ISNUMBER(SEARCH(\"Laboratory evaluations\",'Data extraction-synthesis'!J8)),\"X\",\"\")","v":""},{"$f":"IF(ISNUMBER(SEARCH(\"Models\",'Data extraction-synthesis'!J8)),\"X\",\"\")","v":"X"},{"$f":"IF(ISNUMBER(SEARCH(\"Early usability studies\",'Data extraction-synthesis'!J8)),\"X\",\"\")","v":""},{"$f":"IF(ISNUMBER(SEARCH(\"No input sources reported\",'Data extraction-synthesis'!J8)),\"X\",\"\")","v":""},{"$f":"IF(ISNUMBER(SEARCH(\"N/A\",'Data extraction-synthesis'!J8)),\"X\",\"\")","v":""},null,null,"YES"]
["Gal, M. F., N. A.: Hood, K.: Villacian, J.: Goossens, H.: Watkins, A.: Butler, C. C.","Matching diagnostics development to clinical need: Target product profile development for a point of care test for community-acquired lower respiratory tract infection",{"$f":"IF(ISNUMBER(SEARCH(\"Literature\",'Data extraction-synthesis'!J9)),\"X\",\"\")","v":"X"},{"$f":"IF(ISNUMBER(SEARCH(\"Industry standard\",'Data extraction-synthesis'!J9)),\"X\",\"\")","v":""},{"$f":"IF(ISNUMBER(SEARCH(\"Guidelines\",'Data extraction-synthesis'!J9)),\"X\",\"\")","v":""},{"$f":"IF(ISNUMBER(SEARCH(\"Interviews with experts\",'Data extraction-synthesis'!J9)),\"X\",\"\")","v":""},{"$f":"IF(ISNUMBER(SEARCH(\"Surveys with experts/expert opinion\",'Data extraction-synthesis'!J9)),\"X\",\"\")","v":""},{"$f":"IF(ISNUMBER(SEARCH(\"Consensus meeting inputs\",'Data extraction-synthesis'!J9)),\"X\",\"\")","v":""},{"$f":"IF(ISNUMBER(SEARCH(\"Available data\",'Data extraction-synthesis'!J9)),\"X\",\"\")","v":""},{"$f":"IF(ISNUMBER(SEARCH(\"Field observations\",'Data extraction-synthesis'!J9)),\"X\",\"\")","v":""},{"$f":"IF(ISNUMBER(SEARCH(\"Laboratory evaluations\",'Data extraction-synthesis'!J9)),\"X\",\"\")","v":""},{"$f":"IF(ISNUMBER(SEARCH(\"Models\",'Data extraction-synthesis'!J9)),\"X\",\"\")","v":""},{"$f":"IF(ISNUMBER(SEARCH(\"Early usability studies\",'Data extraction-synthesis'!J9)),\"X\",\"\")","v":""},{"$f":"IF(ISNUMBER(SEARCH(\"No input sources reported\",'Data extraction-synthesis'!J9)),\"X\",\"\")","v":""},{"$f":"IF(ISNUMBER(SEARCH(\"N/A\",'Data extraction-synthesis'!J9)),\"X\",\"\")","v":""},null,null,"NO"]
["Internationa Diagnostics Centre (IDC)","Target Product Profile (TPP): Combined HIV/Syphilis Test",{"$f":"IF(ISNUMBER(SEARCH(\"Literature\",'Data extraction-synthesis'!J39)),\"X\",\"\")","v":""},{"$f":"IF(ISNUMBER(SEARCH(\"Industry standard\",'Data extraction-synthesis'!J39)),\"X\",\"\")","v":""},{"$f":"IF(ISNUMBER(SEARCH(\"Guidelines\",'Data extraction-synthesis'!J39)),\"X\",\"\")","v":""},{"$f":"IF(ISNUMBER(SEARCH(\"Interviews with experts\",'Data extraction-synthesis'!J39)),\"X\",\"\")","v":""},{"$f":"IF(ISNUMBER(SEARCH(\"Surveys with experts/expert opinion\",'Data extraction-synthesis'!J39)),\"X\",\"\")","v":""},{"$f":"IF(ISNUMBER(SEARCH(\"Consensus meeting inputs\",'Data extraction-synthesis'!J39)),\"X\",\"\")","v":""},{"$f":"IF(ISNUMBER(SEARCH(\"Available data\",'Data extraction-synthesis'!J39)),\"X\",\"\")","v":""},{"$f":"IF(ISNUMBER(SEARCH(\"Field observations\",'Data extraction-synthesis'!J39)),\"X\",\"\")","v":""},{"$f":"IF(ISNUMBER(SEARCH(\"Laboratory evaluations\",'Data extraction-synthesis'!J39)),\"X\",\"\")","v":""},{"$f":"IF(ISNUMBER(SEARCH(\"Models\",'Data extraction-synthesis'!J39)),\"X\",\"\")","v":""},{"$f":"IF(ISNUMBER(SEARCH(\"Early usability studies\",'Data extraction-synthesis'!J39)),\"X\",\"\")","v":""},{"$f":"IF(ISNUMBER(SEARCH(\"No input sources reported\",'Data extraction-synthesis'!J39)),\"X\",\"\")","v":"X"},{"$f":"IF(ISNUMBER(SEARCH(\"N/A\",'Data extraction-synthesis'!J39)),\"X\",\"\")","v":""},null,null,"N/A"]
["International Diagnostics Centre (IDC)","Target Product Profile (TPP) - Point-of-Care HIV Viral Load Test",{"$f":"IF(ISNUMBER(SEARCH(\"Literature\",'Data extraction-synthesis'!J36)),\"X\",\"\")","v":""},{"$f":"IF(ISNUMBER(SEARCH(\"Industry standard\",'Data extraction-synthesis'!J36)),\"X\",\"\")","v":""},{"$f":"IF(ISNUMBER(SEARCH(\"Guidelines\",'Data extraction-synthesis'!J36)),\"X\",\"\")","v":""},{"$f":"IF(ISNUMBER(SEARCH(\"Interviews with experts\",'Data extraction-synthesis'!J36)),\"X\",\"\")","v":""},{"$f":"IF(ISNUMBER(SEARCH(\"Surveys with experts/expert opinion\",'Data extraction-synthesis'!J36)),\"X\",\"\")","v":""},{"$f":"IF(ISNUMBER(SEARCH(\"Consensus meeting inputs\",'Data extraction-synthesis'!J36)),\"X\",\"\")","v":""},{"$f":"IF(ISNUMBER(SEARCH(\"Available data\",'Data extraction-synthesis'!J36)),\"X\",\"\")","v":""},{"$f":"IF(ISNUMBER(SEARCH(\"Field observations\",'Data extraction-synthesis'!J36)),\"X\",\"\")","v":""},{"$f":"IF(ISNUMBER(SEARCH(\"Laboratory evaluations\",'Data extraction-synthesis'!J36)),\"X\",\"\")","v":""},{"$f":"IF(ISNUMBER(SEARCH(\"Models\",'Data extraction-synthesis'!J36)),\"X\",\"\")","v":""},{"$f":"IF(ISNUMBER(SEARCH(\"Early usability studies\",'Data extraction-synthesis'!J36)),\"X\",\"\")","v":""},{"$f":"IF(ISNUMBER(SEARCH(\"No input sources reported\",'Data extraction-synthesis'!J36)),\"X\",\"\")","v":"X"},{"$f":"IF(ISNUMBER(SEARCH(\"N/A\",'Data extraction-synthesis'!J36)),\"X\",\"\")","v":""},null,null,"N/A"]
["International Diagnostics Centre (IDC)","Target Product Profile (TPP)- Point of care CD4 test",{"$f":"IF(ISNUMBER(SEARCH(\"Literature\",'Data extraction-synthesis'!J37)),\"X\",\"\")","v":""},{"$f":"IF(ISNUMBER(SEARCH(\"Industry standard\",'Data extraction-synthesis'!J37)),\"X\",\"\")","v":""},{"$f":"IF(ISNUMBER(SEARCH(\"Guidelines\",'Data extraction-synthesis'!J37)),\"X\",\"\")","v":""},{"$f":"IF(ISNUMBER(SEARCH(\"Interviews with experts\",'Data extraction-synthesis'!J37)),\"X\",\"\")","v":""},{"$f":"IF(ISNUMBER(SEARCH(\"Surveys with experts/expert opinion\",'Data extraction-synthesis'!J37)),\"X\",\"\")","v":""},{"$f":"IF(ISNUMBER(SEARCH(\"Consensus meeting inputs\",'Data extraction-synthesis'!J37)),\"X\",\"\")","v":""},{"$f":"IF(ISNUMBER(SEARCH(\"Available data\",'Data extraction-synthesis'!J37)),\"X\",\"\")","v":""},{"$f":"IF(ISNUMBER(SEARCH(\"Field observations\",'Data extraction-synthesis'!J37)),\"X\",\"\")","v":""},{"$f":"IF(ISNUMBER(SEARCH(\"Laboratory evaluations\",'Data extraction-synthesis'!J37)),\"X\",\"\")","v":""},{"$f":"IF(ISNUMBER(SEARCH(\"Models\",'Data extraction-synthesis'!J37)),\"X\",\"\")","v":""},{"$f":"IF(ISNUMBER(SEARCH(\"Early usability studies\",'Data extraction-synthesis'!J37)),\"X\",\"\")","v":""},{"$f":"IF(ISNUMBER(SEARCH(\"No input sources reported\",'Data extraction-synthesis'!J37)),\"X\",\"\")","v":"X"},{"$f":"IF(ISNUMBER(SEARCH(\"N/A\",'Data extraction-synthesis'!J37)),\"X\",\"\")","v":""},null,null,"N/A"]
["International Diagnostics Centre (IDC)","Target Product Profile (TPP): Point of care EID test",{"$f":"IF(ISNUMBER(SEARCH(\"Literature\",'Data extraction-synthesis'!J38)),\"X\",\"\")","v":""},{"$f":"IF(ISNUMBER(SEARCH(\"Industry standard\",'Data extraction-synthesis'!J38)),\"X\",\"\")","v":""},{"$f":"IF(ISNUMBER(SEARCH(\"Guidelines\",'Data extraction-synthesis'!J38)),\"X\",\"\")","v":""},{"$f":"IF(ISNUMBER(SEARCH(\"Interviews with experts\",'Data extraction-synthesis'!J38)),\"X\",\"\")","v":""},{"$f":"IF(ISNUMBER(SEARCH(\"Surveys with experts/expert opinion\",'Data extraction-synthesis'!J38)),\"X\",\"\")","v":""},{"$f":"IF(ISNUMBER(SEARCH(\"Consensus meeting inputs\",'Data extraction-synthesis'!J38)),\"X\",\"\")","v":""},{"$f":"IF(ISNUMBER(SEARCH(\"Available data\",'Data extraction-synthesis'!J38)),\"X\",\"\")","v":""},{"$f":"IF(ISNUMBER(SEARCH(\"Field observations\",'Data extraction-synthesis'!J38)),\"X\",\"\")","v":""},{"$f":"IF(ISNUMBER(SEARCH(\"Laboratory evaluations\",'Data extraction-synthesis'!J38)),\"X\",\"\")","v":""},{"$f":"IF(ISNUMBER(SEARCH(\"Models\",'Data extraction-synthesis'!J38)),\"X\",\"\")","v":""},{"$f":"IF(ISNUMBER(SEARCH(\"Early usability studies\",'Data extraction-synthesis'!J38)),\"X\",\"\")","v":""},{"$f":"IF(ISNUMBER(SEARCH(\"No input sources reported\",'Data extraction-synthesis'!J38)),\"X\",\"\")","v":"X"},{"$f":"IF(ISNUMBER(SEARCH(\"N/A\",'Data extraction-synthesis'!J38)),\"X\",\"\")","v":""},null,null,"N/A"]
["Lim, M. D. B., S. J.: Belizario, V. Y., Jr.: Gay-Andrieu, F.: Gilleard, J.: Levecke, B.: Lieshout, L. van: Medley, G. F.: Mekonnen, Z.: Mirams, G.: Njenga, S. M.: Odiere, M. R.: Rudge, J. W.: Stuyver, L.: Vercruysse, J.: Vlaminck, J.: Walson, J. L. ","Diagnostic tools for soil-transmitted helminths control and elimination programs: a pathway for diagnostic product development",{"$f":"IF(ISNUMBER(SEARCH(\"Literature\",'Data extraction-synthesis'!J10)),\"X\",\"\")","v":"X"},{"$f":"IF(ISNUMBER(SEARCH(\"Industry standard\",'Data extraction-synthesis'!J10)),\"X\",\"\")","v":""},{"$f":"IF(ISNUMBER(SEARCH(\"Guidelines\",'Data extraction-synthesis'!J10)),\"X\",\"\")","v":""},{"$f":"IF(ISNUMBER(SEARCH(\"Interviews with experts\",'Data extraction-synthesis'!J10)),\"X\",\"\")","v":""},{"$f":"IF(ISNUMBER(SEARCH(\"Surveys with experts/expert opinion\",'Data extraction-synthesis'!J10)),\"X\",\"\")","v":""},{"$f":"IF(ISNUMBER(SEARCH(\"Consensus meeting inputs\",'Data extraction-synthesis'!J10)),\"X\",\"\")","v":""},{"$f":"IF(ISNUMBER(SEARCH(\"Available data\",'Data extraction-synthesis'!J10)),\"X\",\"\")","v":""},{"$f":"IF(ISNUMBER(SEARCH(\"Field observations\",'Data extraction-synthesis'!J10)),\"X\",\"\")","v":""},{"$f":"IF(ISNUMBER(SEARCH(\"Laboratory evaluations\",'Data extraction-synthesis'!J10)),\"X\",\"\")","v":""},{"$f":"IF(ISNUMBER(SEARCH(\"Models\",'Data extraction-synthesis'!J10)),\"X\",\"\")","v":""},{"$f":"IF(ISNUMBER(SEARCH(\"Early usability studies\",'Data extraction-synthesis'!J10)),\"X\",\"\")","v":""},{"$f":"IF(ISNUMBER(SEARCH(\"No input sources reported\",'Data extraction-synthesis'!J10)),\"X\",\"\")","v":""},{"$f":"IF(ISNUMBER(SEARCH(\"N/A\",'Data extraction-synthesis'!J10)),\"X\",\"\")","v":""},null,null,"NO"]
["Nsanzabana, C. A., Frederic: Beck, Hans-Peter: Ding, Xavier C.: Kamau, Edwin: Krishna, Sanjeev: Legrand, Eric: Lucchi, Naomi: Miotto, Olivo: Nag, Sidsel: Noedl, Harald: Roper, Cally: Rosenthal, Philip J.: Schallig, Henk D. F. H.: Taylor, Steve M.: Volkman, Sarah K.: Gonzalez, Iveth J.","Molecular assays for antimalarial drug resistance surveillance: A target product profile",{"$f":"IF(ISNUMBER(SEARCH(\"Literature\",'Data extraction-synthesis'!J11)),\"X\",\"\")","v":"X"},{"$f":"IF(ISNUMBER(SEARCH(\"Industry standard\",'Data extraction-synthesis'!J11)),\"X\",\"\")","v":""},{"$f":"IF(ISNUMBER(SEARCH(\"Guidelines\",'Data extraction-synthesis'!J11)),\"X\",\"\")","v":""},{"$f":"IF(ISNUMBER(SEARCH(\"Interviews with experts\",'Data extraction-synthesis'!J11)),\"X\",\"\")","v":""},{"$f":"IF(ISNUMBER(SEARCH(\"Surveys with experts/expert opinion\",'Data extraction-synthesis'!J11)),\"X\",\"\")","v":""},{"$f":"IF(ISNUMBER(SEARCH(\"Consensus meeting inputs\",'Data extraction-synthesis'!J11)),\"X\",\"\")","v":""},{"$f":"IF(ISNUMBER(SEARCH(\"Available data\",'Data extraction-synthesis'!J11)),\"X\",\"\")","v":""},{"$f":"IF(ISNUMBER(SEARCH(\"Field observations\",'Data extraction-synthesis'!J11)),\"X\",\"\")","v":""},{"$f":"IF(ISNUMBER(SEARCH(\"Laboratory evaluations\",'Data extraction-synthesis'!J11)),\"X\",\"\")","v":""},{"$f":"IF(ISNUMBER(SEARCH(\"Models\",'Data extraction-synthesis'!J11)),\"X\",\"\")","v":""},{"$f":"IF(ISNUMBER(SEARCH(\"Early usability studies\",'Data extraction-synthesis'!J11)),\"X\",\"\")","v":""},{"$f":"IF(ISNUMBER(SEARCH(\"No input sources reported\",'Data extraction-synthesis'!J11)),\"X\",\"\")","v":""},{"$f":"IF(ISNUMBER(SEARCH(\"N/A\",'Data extraction-synthesis'!J11)),\"X\",\"\")","v":""},null,null,"NO"]
["Pal S, Jasper L.E., Lawrence K.L, Walter M","Assessing the Dengue Diagnosis Capability Gap in the Military Health System",{"$f":"IF(ISNUMBER(SEARCH(\"Literature\",'Data extraction-synthesis'!J33)),\"X\",\"\")","v":""},{"$f":"IF(ISNUMBER(SEARCH(\"Industry standard\",'Data extraction-synthesis'!J33)),\"X\",\"\")","v":""},{"$f":"IF(ISNUMBER(SEARCH(\"Guidelines\",'Data extraction-synthesis'!J33)),\"X\",\"\")","v":""},{"$f":"IF(ISNUMBER(SEARCH(\"Interviews with experts\",'Data extraction-synthesis'!J33)),\"X\",\"\")","v":""},{"$f":"IF(ISNUMBER(SEARCH(\"Surveys with experts/expert opinion\",'Data extraction-synthesis'!J33)),\"X\",\"\")","v":"X"},{"$f":"IF(ISNUMBER(SEARCH(\"Consensus meeting inputs\",'Data extraction-synthesis'!J33)),\"X\",\"\")","v":""},{"$f":"IF(ISNUMBER(SEARCH(\"Available data\",'Data extraction-synthesis'!J33)),\"X\",\"\")","v":""},{"$f":"IF(ISNUMBER(SEARCH(\"Field observations\",'Data extraction-synthesis'!J33)),\"X\",\"\")","v":""},{"$f":"IF(ISNUMBER(SEARCH(\"Laboratory evaluations\",'Data extraction-synthesis'!J33)),\"X\",\"\")","v":""},{"$f":"IF(ISNUMBER(SEARCH(\"Models\",'Data extraction-synthesis'!J33)),\"X\",\"\")","v":"X"},{"$f":"IF(ISNUMBER(SEARCH(\"Early usability studies\",'Data extraction-synthesis'!J33)),\"X\",\"\")","v":""},{"$f":"IF(ISNUMBER(SEARCH(\"No input sources reported\",'Data extraction-synthesis'!J33)),\"X\",\"\")","v":""},{"$f":"IF(ISNUMBER(SEARCH(\"N/A\",'Data extraction-synthesis'!J33)),\"X\",\"\")","v":""},null,null,"YES"]
["PATH","Target Product Profile: HIV Self-Test Version 4.1: A White Paper on the Evaluation of Current HIV Rapid Tests and Development of Core Specifications for Next-Generation HIV Tests",{"$f":"IF(ISNUMBER(SEARCH(\"Literature\",'Data extraction-synthesis'!J19)),\"X\",\"\")","v":"X"},{"$f":"IF(ISNUMBER(SEARCH(\"Industry standard\",'Data extraction-synthesis'!J19)),\"X\",\"\")","v":""},{"$f":"IF(ISNUMBER(SEARCH(\"Guidelines\",'Data extraction-synthesis'!J19)),\"X\",\"\")","v":""},{"$f":"IF(ISNUMBER(SEARCH(\"Interviews with experts\",'Data extraction-synthesis'!J19)),\"X\",\"\")","v":""},{"$f":"IF(ISNUMBER(SEARCH(\"Surveys with experts/expert opinion\",'Data extraction-synthesis'!J19)),\"X\",\"\")","v":""},{"$f":"IF(ISNUMBER(SEARCH(\"Consensus meeting inputs\",'Data extraction-synthesis'!J19)),\"X\",\"\")","v":""},{"$f":"IF(ISNUMBER(SEARCH(\"Available data\",'Data extraction-synthesis'!J19)),\"X\",\"\")","v":""},{"$f":"IF(ISNUMBER(SEARCH(\"Field observations\",'Data extraction-synthesis'!J19)),\"X\",\"\")","v":""},{"$f":"IF(ISNUMBER(SEARCH(\"Laboratory evaluations\",'Data extraction-synthesis'!J19)),\"X\",\"\")","v":"X"},{"$f":"IF(ISNUMBER(SEARCH(\"Models\",'Data extraction-synthesis'!J19)),\"X\",\"\")","v":""},null,{"$f":"IF(ISNUMBER(SEARCH(\"No input sources reported\",'Data extraction-synthesis'!J19)),\"X\",\"\")","v":""},{"$f":"IF(ISNUMBER(SEARCH(\"N/A\",'Data extraction-synthesis'!J19)),\"X\",\"\")","v":""},null,null,"YES"]
["PATH","Diagnostics for neglected tropical diseases: Defining the best tools through target product profiles",{"$f":"IF(ISNUMBER(SEARCH(\"Literature\",'Data extraction-synthesis'!J20)),\"X\",\"\")","v":""},{"$f":"IF(ISNUMBER(SEARCH(\"Industry standard\",'Data extraction-synthesis'!J20)),\"X\",\"\")","v":""},{"$f":"IF(ISNUMBER(SEARCH(\"Guidelines\",'Data extraction-synthesis'!J20)),\"X\",\"\")","v":""},{"$f":"IF(ISNUMBER(SEARCH(\"Interviews with experts\",'Data extraction-synthesis'!J20)),\"X\",\"\")","v":""},{"$f":"IF(ISNUMBER(SEARCH(\"Surveys with experts/expert opinion\",'Data extraction-synthesis'!J20)),\"X\",\"\")","v":""},{"$f":"IF(ISNUMBER(SEARCH(\"Consensus meeting inputs\",'Data extraction-synthesis'!J20)),\"X\",\"\")","v":""},{"$f":"IF(ISNUMBER(SEARCH(\"Available data\",'Data extraction-synthesis'!J20)),\"X\",\"\")","v":""},{"$f":"IF(ISNUMBER(SEARCH(\"Field observations\",'Data extraction-synthesis'!J20)),\"X\",\"\")","v":""},{"$f":"IF(ISNUMBER(SEARCH(\"Laboratory evaluations\",'Data extraction-synthesis'!J20)),\"X\",\"\")","v":""},{"$f":"IF(ISNUMBER(SEARCH(\"Models\",'Data extraction-synthesis'!J20)),\"X\",\"\")","v":""},{"$f":"IF(ISNUMBER(SEARCH(\"Early usability studies\",'Data extraction-synthesis'!J20)),\"X\",\"\")","v":""},{"$f":"IF(ISNUMBER(SEARCH(\"No input sources reported\",'Data extraction-synthesis'!J20)),\"X\",\"\")","v":""},{"$f":"IF(ISNUMBER(SEARCH(\"N/A\",'Data extraction-synthesis'!J20)),\"X\",\"\")","v":"X"},null,null,"N/A"]
["PATH","Target Product Profile: Schistosomiasis Surveillance Diagnostic",{"$f":"IF(ISNUMBER(SEARCH(\"Literature\",'Data extraction-synthesis'!J21)),\"X\",\"\")","v":"X"},{"$f":"IF(ISNUMBER(SEARCH(\"Industry standard\",'Data extraction-synthesis'!J21)),\"X\",\"\")","v":""},{"$f":"IF(ISNUMBER(SEARCH(\"Guidelines\",'Data extraction-synthesis'!J21)),\"X\",\"\")","v":""},{"$f":"IF(ISNUMBER(SEARCH(\"Interviews with experts\",'Data extraction-synthesis'!J21)),\"X\",\"\")","v":""},{"$f":"IF(ISNUMBER(SEARCH(\"Surveys with experts/expert opinion\",'Data extraction-synthesis'!J21)),\"X\",\"\")","v":""},{"$f":"IF(ISNUMBER(SEARCH(\"Consensus meeting inputs\",'Data extraction-synthesis'!J21)),\"X\",\"\")","v":""},{"$f":"IF(ISNUMBER(SEARCH(\"Available data\",'Data extraction-synthesis'!J21)),\"X\",\"\")","v":""},{"$f":"IF(ISNUMBER(SEARCH(\"Field observations\",'Data extraction-synthesis'!J21)),\"X\",\"\")","v":""},{"$f":"IF(ISNUMBER(SEARCH(\"Laboratory evaluations\",'Data extraction-synthesis'!J21)),\"X\",\"\")","v":""},{"$f":"IF(ISNUMBER(SEARCH(\"Models\",'Data extraction-synthesis'!J21)),\"X\",\"\")","v":""},{"$f":"IF(ISNUMBER(SEARCH(\"Early usability studies\",'Data extraction-synthesis'!J21)),\"X\",\"\")","v":""},{"$f":"IF(ISNUMBER(SEARCH(\"No input sources reported\",'Data extraction-synthesis'!J21)),\"X\",\"\")","v":""},{"$f":"IF(ISNUMBER(SEARCH(\"N/A\",'Data extraction-synthesis'!J21)),\"X\",\"\")","v":""},null,null,"NO"]
["PATH","Target Product Profile: Schistosomiasis Surveillance Diagnostic Lateral Flow Test CAA antigen",{"$f":"IF(ISNUMBER(SEARCH(\"Literature\",'Data extraction-synthesis'!J34)),\"X\",\"\")","v":"X"},{"$f":"IF(ISNUMBER(SEARCH(\"Industry standard\",'Data extraction-synthesis'!J34)),\"X\",\"\")","v":""},{"$f":"IF(ISNUMBER(SEARCH(\"Guidelines\",'Data extraction-synthesis'!J34)),\"X\",\"\")","v":""},{"$f":"IF(ISNUMBER(SEARCH(\"Interviews with experts\",'Data extraction-synthesis'!J34)),\"X\",\"\")","v":""},{"$f":"IF(ISNUMBER(SEARCH(\"Surveys with experts/expert opinion\",'Data extraction-synthesis'!J34)),\"X\",\"\")","v":""},{"$f":"IF(ISNUMBER(SEARCH(\"Consensus meeting inputs\",'Data extraction-synthesis'!J34)),\"X\",\"\")","v":""},{"$f":"IF(ISNUMBER(SEARCH(\"Available data\",'Data extraction-synthesis'!J34)),\"X\",\"\")","v":""},{"$f":"IF(ISNUMBER(SEARCH(\"Field observations\",'Data extraction-synthesis'!J34)),\"X\",\"\")","v":""},{"$f":"IF(ISNUMBER(SEARCH(\"Laboratory evaluations\",'Data extraction-synthesis'!J34)),\"X\",\"\")","v":""},{"$f":"IF(ISNUMBER(SEARCH(\"Models\",'Data extraction-synthesis'!J34)),\"X\",\"\")","v":""},{"$f":"IF(ISNUMBER(SEARCH(\"Early usability studies\",'Data extraction-synthesis'!J34)),\"X\",\"\")","v":""},{"$f":"IF(ISNUMBER(SEARCH(\"No input sources reported\",'Data extraction-synthesis'!J34)),\"X\",\"\")","v":""},{"$f":"IF(ISNUMBER(SEARCH(\"N/A\",'Data extraction-synthesis'!J34)),\"X\",\"\")","v":""},null,null,"NO"]
["PATH","Target Product Profile: Trachoma Surveillance Diagnostic-Post-Elimination Surveillance Antibody Lateral Flow Test",{"$f":"IF(ISNUMBER(SEARCH(\"Literature\",'Data extraction-synthesis'!J35)),\"X\",\"\")","v":"X"},{"$f":"IF(ISNUMBER(SEARCH(\"Industry standard\",'Data extraction-synthesis'!J35)),\"X\",\"\")","v":""},{"$f":"IF(ISNUMBER(SEARCH(\"Guidelines\",'Data extraction-synthesis'!J35)),\"X\",\"\")","v":""},{"$f":"IF(ISNUMBER(SEARCH(\"Interviews with experts\",'Data extraction-synthesis'!J35)),\"X\",\"\")","v":""},{"$f":"IF(ISNUMBER(SEARCH(\"Surveys with experts/expert opinion\",'Data extraction-synthesis'!J35)),\"X\",\"\")","v":""},{"$f":"IF(ISNUMBER(SEARCH(\"Consensus meeting inputs\",'Data extraction-synthesis'!J35)),\"X\",\"\")","v":""},{"$f":"IF(ISNUMBER(SEARCH(\"Available data\",'Data extraction-synthesis'!J35)),\"X\",\"\")","v":""},{"$f":"IF(ISNUMBER(SEARCH(\"Field observations\",'Data extraction-synthesis'!J35)),\"X\",\"\")","v":""},{"$f":"IF(ISNUMBER(SEARCH(\"Laboratory evaluations\",'Data extraction-synthesis'!J35)),\"X\",\"\")","v":""},{"$f":"IF(ISNUMBER(SEARCH(\"Models\",'Data extraction-synthesis'!J35)),\"X\",\"\")","v":""},{"$f":"IF(ISNUMBER(SEARCH(\"Early usability studies\",'Data extraction-synthesis'!J35)),\"X\",\"\")","v":""},{"$f":"IF(ISNUMBER(SEARCH(\"No input sources reported\",'Data extraction-synthesis'!J35)),\"X\",\"\")","v":""},{"$f":"IF(ISNUMBER(SEARCH(\"N/A\",'Data extraction-synthesis'!J35)),\"X\",\"\")","v":""},null,null,"NO"]
["PATH","Target Product Profile: Trachoma surveillance diagnostic-antigen lateral flow test",{"$f":"IF(ISNUMBER(SEARCH(\"Literature\",'Data extraction-synthesis'!J42)),\"X\",\"\")","v":"X"},{"$f":"IF(ISNUMBER(SEARCH(\"Industry standard\",'Data extraction-synthesis'!J42)),\"X\",\"\")","v":""},{"$f":"IF(ISNUMBER(SEARCH(\"Guidelines\",'Data extraction-synthesis'!J42)),\"X\",\"\")","v":""},{"$f":"IF(ISNUMBER(SEARCH(\"Interviews with experts\",'Data extraction-synthesis'!J42)),\"X\",\"\")","v":""},{"$f":"IF(ISNUMBER(SEARCH(\"Surveys with experts/expert opinion\",'Data extraction-synthesis'!J42)),\"X\",\"\")","v":""},{"$f":"IF(ISNUMBER(SEARCH(\"Consensus meeting inputs\",'Data extraction-synthesis'!J42)),\"X\",\"\")","v":""},{"$f":"IF(ISNUMBER(SEARCH(\"Available data\",'Data extraction-synthesis'!J42)),\"X\",\"\")","v":""},{"$f":"IF(ISNUMBER(SEARCH(\"Field observations\",'Data extraction-synthesis'!J42)),\"X\",\"\")","v":""},{"$f":"IF(ISNUMBER(SEARCH(\"Laboratory evaluations\",'Data extraction-synthesis'!J42)),\"X\",\"\")","v":""},{"$f":"IF(ISNUMBER(SEARCH(\"Models\",'Data extraction-synthesis'!J42)),\"X\",\"\")","v":""},{"$f":"IF(ISNUMBER(SEARCH(\"Early usability studies\",'Data extraction-synthesis'!J42)),\"X\",\"\")","v":""},{"$f":"IF(ISNUMBER(SEARCH(\"No input sources reported\",'Data extraction-synthesis'!J42)),\"X\",\"\")","v":""},{"$f":"IF(ISNUMBER(SEARCH(\"N/A\",'Data extraction-synthesis'!J42)),\"X\",\"\")","v":""},null,null,"NO"]
["PATH","Target Product Profile: Schistosomiasis Surveillance Diagnostic - schistosoma genus-specific antibody lateral flow test post-elimination surveillance",null,{"$f":"IF(ISNUMBER(SEARCH(\"Industry standard\",'Data extraction-synthesis'!J44)),\"X\",\"\")","v":""},{"$f":"IF(ISNUMBER(SEARCH(\"Guidelines\",'Data extraction-synthesis'!J44)),\"X\",\"\")","v":""},{"$f":"IF(ISNUMBER(SEARCH(\"Interviews with experts\",'Data extraction-synthesis'!J44)),\"X\",\"\")","v":""},{"$f":"IF(ISNUMBER(SEARCH(\"Surveys with experts/expert opinion\",'Data extraction-synthesis'!J44)),\"X\",\"\")","v":""},{"$f":"IF(ISNUMBER(SEARCH(\"Consensus meeting inputs\",'Data extraction-synthesis'!J44)),\"X\",\"\")","v":""},{"$f":"IF(ISNUMBER(SEARCH(\"Available data\",'Data extraction-synthesis'!J44)),\"X\",\"\")","v":""},{"$f":"IF(ISNUMBER(SEARCH(\"Field observations\",'Data extraction-synthesis'!J44)),\"X\",\"\")","v":""},{"$f":"IF(ISNUMBER(SEARCH(\"Laboratory evaluations\",'Data extraction-synthesis'!J44)),\"X\",\"\")","v":""},{"$f":"IF(ISNUMBER(SEARCH(\"Models\",'Data extraction-synthesis'!J44)),\"X\",\"\")","v":""},{"$f":"IF(ISNUMBER(SEARCH(\"Early usability studies\",'Data extraction-synthesis'!J44)),\"X\",\"\")","v":""},null,"x",null,null,"N/A"]
["Peck, R. B. W., J. D.: Boettcher, M. G.: Downing","Defining product requirements for field deployable yellow fever tests",{"$f":"IF(ISNUMBER(SEARCH(\"Literature\",'Data extraction-synthesis'!J43)),\"X\",\"\")","v":""},{"$f":"IF(ISNUMBER(SEARCH(\"Industry standard\",'Data extraction-synthesis'!J43)),\"X\",\"\")","v":""},{"$f":"IF(ISNUMBER(SEARCH(\"Guidelines\",'Data extraction-synthesis'!J43)),\"X\",\"\")","v":""},{"$f":"IF(ISNUMBER(SEARCH(\"Interviews with experts\",'Data extraction-synthesis'!J43)),\"X\",\"\")","v":""},{"$f":"IF(ISNUMBER(SEARCH(\"Surveys with experts/expert opinion\",'Data extraction-synthesis'!J43)),\"X\",\"\")","v":""},{"$f":"IF(ISNUMBER(SEARCH(\"Consensus meeting inputs\",'Data extraction-synthesis'!J43)),\"X\",\"\")","v":""},{"$f":"IF(ISNUMBER(SEARCH(\"Available data\",'Data extraction-synthesis'!J43)),\"X\",\"\")","v":""},{"$f":"IF(ISNUMBER(SEARCH(\"Field observations\",'Data extraction-synthesis'!J43)),\"X\",\"\")","v":""},{"$f":"IF(ISNUMBER(SEARCH(\"Laboratory evaluations\",'Data extraction-synthesis'!J43)),\"X\",\"\")","v":""},{"$f":"IF(ISNUMBER(SEARCH(\"Models\",'Data extraction-synthesis'!J43)),\"X\",\"\")","v":""},{"$f":"IF(ISNUMBER(SEARCH(\"Early usability studies\",'Data extraction-synthesis'!J43)),\"X\",\"\")","v":""},{"$f":"IF(ISNUMBER(SEARCH(\"No input sources reported\",'Data extraction-synthesis'!J43)),\"X\",\"\")","v":""},{"$f":"IF(ISNUMBER(SEARCH(\"N/A\",'Data extraction-synthesis'!J43)),\"X\",\"\")","v":"X"},null,null,"N/A"]
["Porras, A. I. Y., Z. E.: Altcheh, J.: Britto, C.: Chaves, G. C.: Flevaud, L.: Martins, O. A.: Ribeiro, I.: Schijman, A. G.: Shikanai-Yasuda, M. A.: Sosa-Estani, S.: Stobbaerts, E.: Zicker, F.","Target Product Profile (TPP) for Chagas Disease Point-of-Care Diagnosis and Assessment of Response to Treatmen",{"$f":"IF(ISNUMBER(SEARCH(\"Literature\",'Data extraction-synthesis'!J12)),\"X\",\"\")","v":""},{"$f":"IF(ISNUMBER(SEARCH(\"Industry standard\",'Data extraction-synthesis'!J12)),\"X\",\"\")","v":""},{"$f":"IF(ISNUMBER(SEARCH(\"Guidelines\",'Data extraction-synthesis'!J12)),\"X\",\"\")","v":""},{"$f":"IF(ISNUMBER(SEARCH(\"Interviews with experts\",'Data extraction-synthesis'!J12)),\"X\",\"\")","v":""},{"$f":"IF(ISNUMBER(SEARCH(\"Surveys with experts/expert opinion\",'Data extraction-synthesis'!J12)),\"X\",\"\")","v":""},{"$f":"IF(ISNUMBER(SEARCH(\"Consensus meeting inputs\",'Data extraction-synthesis'!J12)),\"X\",\"\")","v":""},{"$f":"IF(ISNUMBER(SEARCH(\"Available data\",'Data extraction-synthesis'!J12)),\"X\",\"\")","v":""},{"$f":"IF(ISNUMBER(SEARCH(\"Field observations\",'Data extraction-synthesis'!J12)),\"X\",\"\")","v":""},{"$f":"IF(ISNUMBER(SEARCH(\"Laboratory evaluations\",'Data extraction-synthesis'!J12)),\"X\",\"\")","v":""},{"$f":"IF(ISNUMBER(SEARCH(\"Models\",'Data extraction-synthesis'!J12)),\"X\",\"\")","v":""},{"$f":"IF(ISNUMBER(SEARCH(\"Early usability studies\",'Data extraction-synthesis'!J12)),\"X\",\"\")","v":""},{"$f":"IF(ISNUMBER(SEARCH(\"No input sources reported\",'Data extraction-synthesis'!J12)),\"X\",\"\")","v":"X"},{"$f":"IF(ISNUMBER(SEARCH(\"N/A\",'Data extraction-synthesis'!J12)),\"X\",\"\")","v":""},null,null,"N/A"]
["Reipold, E. I. E., Philippa: Trianni, Alessandra: Panneer, Nivedha: Krakower, Douglas: Ongarello, Stefano: Roberts, Teri: Miller, Veronica: Denkinger, Claudia","Optimising diagnosis of viraemic hepatitis C infection: the development of a target product profile",{"$f":"IF(ISNUMBER(SEARCH(\"Literature\",'Data extraction-synthesis'!J13)),\"X\",\"\")","v":"X"},{"$f":"IF(ISNUMBER(SEARCH(\"Industry standard\",'Data extraction-synthesis'!J13)),\"X\",\"\")","v":""},{"$f":"IF(ISNUMBER(SEARCH(\"Guidelines\",'Data extraction-synthesis'!J13)),\"X\",\"\")","v":""},{"$f":"IF(ISNUMBER(SEARCH(\"Interviews with experts\",'Data extraction-synthesis'!J13)),\"X\",\"\")","v":""},{"$f":"IF(ISNUMBER(SEARCH(\"Surveys with experts/expert opinion\",'Data extraction-synthesis'!J13)),\"X\",\"\")","v":"X"},{"$f":"IF(ISNUMBER(SEARCH(\"Consensus meeting inputs\",'Data extraction-synthesis'!J13)),\"X\",\"\")","v":""},{"$f":"IF(ISNUMBER(SEARCH(\"Available data\",'Data extraction-synthesis'!J13)),\"X\",\"\")","v":""},{"$f":"IF(ISNUMBER(SEARCH(\"Field observations\",'Data extraction-synthesis'!J13)),\"X\",\"\")","v":""},{"$f":"IF(ISNUMBER(SEARCH(\"Laboratory evaluations\",'Data extraction-synthesis'!J13)),\"X\",\"\")","v":""},{"$f":"IF(ISNUMBER(SEARCH(\"Models\",'Data extraction-synthesis'!J13)),\"X\",\"\")","v":"X"},{"$f":"IF(ISNUMBER(SEARCH(\"Early usability studies\",'Data extraction-synthesis'!J13)),\"X\",\"\")","v":""},{"$f":"IF(ISNUMBER(SEARCH(\"No input sources reported\",'Data extraction-synthesis'!J13)),\"X\",\"\")","v":""},{"$f":"IF(ISNUMBER(SEARCH(\"N/A\",'Data extraction-synthesis'!J13)),\"X\",\"\")","v":""},null,null,"YES"]
["Solomon, A. W. E., D.: Bailey, R. L.: Blake, I. M.: Brooker, S.: Chen, J. X.: Chen, J. H.: Churcher, T. S.: Drakeley, C. J.: Edwards, T.: Fenwick, A.: French, M.: Gabrielli, A. F.: Grassly, N. C.: Harding-Esch, E. M.: Holland, M. J.: Koukounari, A.: Lammie, P. J.: Leslie, J.: Mabey, D. C.: Rhajaoui, M.: Secor, W. E.: Stothard, J. R.: Wei, H.: Willingham, A. L.: Zhou, X. N.: Peeling, R. W.","A diagnostics platform for the integrated mapping, monitoring, and surveillance of neglected tropical diseases: Rationale and target product profiles",{"$f":"IF(ISNUMBER(SEARCH(\"Literature\",'Data extraction-synthesis'!J14)),\"X\",\"\")","v":""},{"$f":"IF(ISNUMBER(SEARCH(\"Industry standard\",'Data extraction-synthesis'!J14)),\"X\",\"\")","v":""},{"$f":"IF(ISNUMBER(SEARCH(\"Guidelines\",'Data extraction-synthesis'!J14)),\"X\",\"\")","v":""},{"$f":"IF(ISNUMBER(SEARCH(\"Interviews with experts\",'Data extraction-synthesis'!J14)),\"X\",\"\")","v":""},{"$f":"IF(ISNUMBER(SEARCH(\"Surveys with experts/expert opinion\",'Data extraction-synthesis'!J14)),\"X\",\"\")","v":""},{"$f":"IF(ISNUMBER(SEARCH(\"Consensus meeting inputs\",'Data extraction-synthesis'!J14)),\"X\",\"\")","v":""},{"$f":"IF(ISNUMBER(SEARCH(\"Available data\",'Data extraction-synthesis'!J14)),\"X\",\"\")","v":""},{"$f":"IF(ISNUMBER(SEARCH(\"Field observations\",'Data extraction-synthesis'!J14)),\"X\",\"\")","v":""},{"$f":"IF(ISNUMBER(SEARCH(\"Laboratory evaluations\",'Data extraction-synthesis'!J14)),\"X\",\"\")","v":""},{"$f":"IF(ISNUMBER(SEARCH(\"Models\",'Data extraction-synthesis'!J14)),\"X\",\"\")","v":""},{"$f":"IF(ISNUMBER(SEARCH(\"Early usability studies\",'Data extraction-synthesis'!J14)),\"X\",\"\")","v":""},{"$f":"IF(ISNUMBER(SEARCH(\"No input sources reported\",'Data extraction-synthesis'!J14)),\"X\",\"\")","v":"X"},{"$f":"IF(ISNUMBER(SEARCH(\"N/A\",'Data extraction-synthesis'!J14)),\"X\",\"\")","v":""},null,null,"N/A"]
["Toskin, I. M., M.: Peeling, R. W.: Blondeel, K.: Cordero, J.: Kiarie, J.","Advancing prevention of sexually transmitted infections through point-of-care testing: target product profiles and landscape analysis",{"$f":"IF(ISNUMBER(SEARCH(\"Literature\",'Data extraction-synthesis'!J15)),\"X\",\"\")","v":""},{"$f":"IF(ISNUMBER(SEARCH(\"Industry standard\",'Data extraction-synthesis'!J15)),\"X\",\"\")","v":""},{"$f":"IF(ISNUMBER(SEARCH(\"Guidelines\",'Data extraction-synthesis'!J15)),\"X\",\"\")","v":""},{"$f":"IF(ISNUMBER(SEARCH(\"Interviews with experts\",'Data extraction-synthesis'!J15)),\"X\",\"\")","v":""},{"$f":"IF(ISNUMBER(SEARCH(\"Surveys with experts/expert opinion\",'Data extraction-synthesis'!J15)),\"X\",\"\")","v":""},{"$f":"IF(ISNUMBER(SEARCH(\"Consensus meeting inputs\",'Data extraction-synthesis'!J15)),\"X\",\"\")","v":"X"},{"$f":"IF(ISNUMBER(SEARCH(\"Available data\",'Data extraction-synthesis'!J15)),\"X\",\"\")","v":""},{"$f":"IF(ISNUMBER(SEARCH(\"Field observations\",'Data extraction-synthesis'!J15)),\"X\",\"\")","v":""},{"$f":"IF(ISNUMBER(SEARCH(\"Laboratory evaluations\",'Data extraction-synthesis'!J15)),\"X\",\"\")","v":""},{"$f":"IF(ISNUMBER(SEARCH(\"Models\",'Data extraction-synthesis'!J15)),\"X\",\"\")","v":""},{"$f":"IF(ISNUMBER(SEARCH(\"Early usability studies\",'Data extraction-synthesis'!J15)),\"X\",\"\")","v":""},{"$f":"IF(ISNUMBER(SEARCH(\"No input sources reported\",'Data extraction-synthesis'!J15)),\"X\",\"\")","v":""},{"$f":"IF(ISNUMBER(SEARCH(\"N/A\",'Data extraction-synthesis'!J15)),\"X\",\"\")","v":""},null,null,"NO"]
["UNICEF","UNICEF Target Product Profile Rapid E.coli Detection (version 2.0)",{"$f":"IF(ISNUMBER(SEARCH(\"Literature\",'Data extraction-synthesis'!#REF!)),\"X\",\"\")","v":""},{"$f":"IF(ISNUMBER(SEARCH(\"Industry standard\",'Data extraction-synthesis'!#REF!)),\"X\",\"\")","v":""},{"$f":"IF(ISNUMBER(SEARCH(\"Guidelines\",'Data extraction-synthesis'!#REF!)),\"X\",\"\")","v":""},{"$f":"IF(ISNUMBER(SEARCH(\"Interviews with experts\",'Data extraction-synthesis'!#REF!)),\"X\",\"\")","v":""},{"$f":"IF(ISNUMBER(SEARCH(\"Surveys with experts/expert opinion\",'Data extraction-synthesis'!#REF!)),\"X\",\"\")","v":""},{"$f":"IF(ISNUMBER(SEARCH(\"Consensus meeting inputs\",'Data extraction-synthesis'!#REF!)),\"X\",\"\")","v":""},{"$f":"IF(ISNUMBER(SEARCH(\"Available data\",'Data extraction-synthesis'!#REF!)),\"X\",\"\")","v":""},{"$f":"IF(ISNUMBER(SEARCH(\"Field observations\",'Data extraction-synthesis'!#REF!)),\"X\",\"\")","v":""},{"$f":"IF(ISNUMBER(SEARCH(\"Laboratory evaluations\",'Data extraction-synthesis'!#REF!)),\"X\",\"\")","v":""},{"$f":"IF(ISNUMBER(SEARCH(\"Models\",'Data extraction-synthesis'!#REF!)),\"X\",\"\")","v":""},{"$f":"IF(ISNUMBER(SEARCH(\"Early usability studies\",'Data extraction-synthesis'!#REF!)),\"X\",\"\")","v":""},{"$f":"IF(ISNUMBER(SEARCH(\"No input sources reported\",'Data extraction-synthesis'!J22)),\"X\",\"\")","v":"X"},{"$f":"IF(ISNUMBER(SEARCH(\"N/A\",'Data extraction-synthesis'!#REF!)),\"X\",\"\")","v":""},null,null,"N/A"]
["UNICEF","UNICEF Target Product Profile Rapid E.coli Detection (1.4)",{"$f":"IF(ISNUMBER(SEARCH(\"Literature\",'Data extraction-synthesis'!J22)),\"X\",\"\")","v":""},{"$f":"IF(ISNUMBER(SEARCH(\"Industry standard\",'Data extraction-synthesis'!J22)),\"X\",\"\")","v":""},{"$f":"IF(ISNUMBER(SEARCH(\"Guidelines\",'Data extraction-synthesis'!J22)),\"X\",\"\")","v":""},{"$f":"IF(ISNUMBER(SEARCH(\"Interviews with experts\",'Data extraction-synthesis'!J22)),\"X\",\"\")","v":""},{"$f":"IF(ISNUMBER(SEARCH(\"Surveys with experts/expert opinion\",'Data extraction-synthesis'!J22)),\"X\",\"\")","v":""},{"$f":"IF(ISNUMBER(SEARCH(\"Consensus meeting inputs\",'Data extraction-synthesis'!J22)),\"X\",\"\")","v":""},{"$f":"IF(ISNUMBER(SEARCH(\"Available data\",'Data extraction-synthesis'!J22)),\"X\",\"\")","v":""},{"$f":"IF(ISNUMBER(SEARCH(\"Field observations\",'Data extraction-synthesis'!J22)),\"X\",\"\")","v":""},{"$f":"IF(ISNUMBER(SEARCH(\"Laboratory evaluations\",'Data extraction-synthesis'!J22)),\"X\",\"\")","v":""},{"$f":"IF(ISNUMBER(SEARCH(\"Models\",'Data extraction-synthesis'!J22)),\"X\",\"\")","v":""},{"$f":"IF(ISNUMBER(SEARCH(\"Early usability studies\",'Data extraction-synthesis'!J22)),\"X\",\"\")","v":""},{"$f":"IF(ISNUMBER(SEARCH(\"No input sources reported\",'Data extraction-synthesis'!J23)),\"X\",\"\")","v":"X"},{"$f":"IF(ISNUMBER(SEARCH(\"N/A\",'Data extraction-synthesis'!J22)),\"X\",\"\")","v":""},null,null,"N/A"]
["UNICEF","Zika Virus Diagnostics: Target Product Profiles & Supply Update",{"$f":"IF(ISNUMBER(SEARCH(\"Literature\",'Data extraction-synthesis'!J31)),\"X\",\"\")","v":""},{"$f":"IF(ISNUMBER(SEARCH(\"Industry standard\",'Data extraction-synthesis'!J31)),\"X\",\"\")","v":""},{"$f":"IF(ISNUMBER(SEARCH(\"Guidelines\",'Data extraction-synthesis'!J31)),\"X\",\"\")","v":""},{"$f":"IF(ISNUMBER(SEARCH(\"Interviews with experts\",'Data extraction-synthesis'!J31)),\"X\",\"\")","v":""},{"$f":"IF(ISNUMBER(SEARCH(\"Surveys with experts/expert opinion\",'Data extraction-synthesis'!J31)),\"X\",\"\")","v":""},{"$f":"IF(ISNUMBER(SEARCH(\"Consensus meeting inputs\",'Data extraction-synthesis'!J31)),\"X\",\"\")","v":""},{"$f":"IF(ISNUMBER(SEARCH(\"Available data\",'Data extraction-synthesis'!J31)),\"X\",\"\")","v":""},{"$f":"IF(ISNUMBER(SEARCH(\"Field observations\",'Data extraction-synthesis'!J31)),\"X\",\"\")","v":""},{"$f":"IF(ISNUMBER(SEARCH(\"Laboratory evaluations\",'Data extraction-synthesis'!J31)),\"X\",\"\")","v":""},{"$f":"IF(ISNUMBER(SEARCH(\"Models\",'Data extraction-synthesis'!J31)),\"X\",\"\")","v":""},{"$f":"IF(ISNUMBER(SEARCH(\"Early usability studies\",'Data extraction-synthesis'!J31)),\"X\",\"\")","v":""},{"$f":"IF(ISNUMBER(SEARCH(\"No input sources reported\",'Data extraction-synthesis'!J31)),\"X\",\"\")","v":""},{"$f":"IF(ISNUMBER(SEARCH(\"N/A\",'Data extraction-synthesis'!J31)),\"X\",\"\")","v":"X"},null,null,"N/A"]
["UNICEF","Pneumonia Acute Respiratory Infection Diagnostic Aid-Target Product Profile Introduction",{"$f":"IF(ISNUMBER(SEARCH(\"Literature\",'Data extraction-synthesis'!J32)),\"X\",\"\")","v":""},{"$f":"IF(ISNUMBER(SEARCH(\"Industry standard\",'Data extraction-synthesis'!J32)),\"X\",\"\")","v":""},{"$f":"IF(ISNUMBER(SEARCH(\"Guidelines\",'Data extraction-synthesis'!J32)),\"X\",\"\")","v":""},{"$f":"IF(ISNUMBER(SEARCH(\"Interviews with experts\",'Data extraction-synthesis'!J32)),\"X\",\"\")","v":""},{"$f":"IF(ISNUMBER(SEARCH(\"Surveys with experts/expert opinion\",'Data extraction-synthesis'!J32)),\"X\",\"\")","v":""},{"$f":"IF(ISNUMBER(SEARCH(\"Consensus meeting inputs\",'Data extraction-synthesis'!J32)),\"X\",\"\")","v":""},{"$f":"IF(ISNUMBER(SEARCH(\"Available data\",'Data extraction-synthesis'!J32)),\"X\",\"\")","v":""},{"$f":"IF(ISNUMBER(SEARCH(\"Field observations\",'Data extraction-synthesis'!J32)),\"X\",\"\")","v":""},{"$f":"IF(ISNUMBER(SEARCH(\"Laboratory evaluations\",'Data extraction-synthesis'!J32)),\"X\",\"\")","v":""},{"$f":"IF(ISNUMBER(SEARCH(\"Models\",'Data extraction-synthesis'!J32)),\"X\",\"\")","v":""},{"$f":"IF(ISNUMBER(SEARCH(\"Early usability studies\",'Data extraction-synthesis'!J32)),\"X\",\"\")","v":""},{"$f":"IF(ISNUMBER(SEARCH(\"No input sources reported\",'Data extraction-synthesis'!J32)),\"X\",\"\")","v":""},{"$f":"IF(ISNUMBER(SEARCH(\"N/A\",'Data extraction-synthesis'!J32)),\"X\",\"\")","v":"X"},null,null,"N/A"]
["Utzinger, J. B., S. L.: van Lieshout, L.: van Dam, G. J.: Knopp, S","New diagnostic tools in schistosomiasis",{"$f":"IF(ISNUMBER(SEARCH(\"Literature\",'Data extraction-synthesis'!J30)),\"X\",\"\")","v":""},{"$f":"IF(ISNUMBER(SEARCH(\"Industry standard\",'Data extraction-synthesis'!J30)),\"X\",\"\")","v":""},{"$f":"IF(ISNUMBER(SEARCH(\"Guidelines\",'Data extraction-synthesis'!J30)),\"X\",\"\")","v":""},{"$f":"IF(ISNUMBER(SEARCH(\"Interviews with experts\",'Data extraction-synthesis'!J30)),\"X\",\"\")","v":""},{"$f":"IF(ISNUMBER(SEARCH(\"Surveys with experts/expert opinion\",'Data extraction-synthesis'!J30)),\"X\",\"\")","v":""},{"$f":"IF(ISNUMBER(SEARCH(\"Consensus meeting inputs\",'Data extraction-synthesis'!J30)),\"X\",\"\")","v":""},{"$f":"IF(ISNUMBER(SEARCH(\"Available data\",'Data extraction-synthesis'!J30)),\"X\",\"\")","v":""},{"$f":"IF(ISNUMBER(SEARCH(\"Field observations\",'Data extraction-synthesis'!J30)),\"X\",\"\")","v":""},{"$f":"IF(ISNUMBER(SEARCH(\"Laboratory evaluations\",'Data extraction-synthesis'!J30)),\"X\",\"\")","v":""},{"$f":"IF(ISNUMBER(SEARCH(\"Models\",'Data extraction-synthesis'!J30)),\"X\",\"\")","v":""},{"$f":"IF(ISNUMBER(SEARCH(\"Early usability studies\",'Data extraction-synthesis'!J30)),\"X\",\"\")","v":""},{"$f":"IF(ISNUMBER(SEARCH(\"No input sources reported\",'Data extraction-synthesis'!J30)),\"X\",\"\")","v":""},{"$f":"IF(ISNUMBER(SEARCH(\"N/A\",'Data extraction-synthesis'!J30)),\"X\",\"\")","v":"X"},null,null,"N/A"]
["WHO","High-priority target product profile for new tubercolosis diagnostics: report of a consensus meeting",{"$f":"IF(ISNUMBER(SEARCH(\"Literature\",'Data extraction-synthesis'!J24)),\"X\",\"\")","v":"X"},{"$f":"IF(ISNUMBER(SEARCH(\"Industry standard\",'Data extraction-synthesis'!J24)),\"X\",\"\")","v":""},{"$f":"IF(ISNUMBER(SEARCH(\"Guidelines\",'Data extraction-synthesis'!J24)),\"X\",\"\")","v":""},{"$f":"IF(ISNUMBER(SEARCH(\"Interviews with experts\",'Data extraction-synthesis'!J24)),\"X\",\"\")","v":""},{"$f":"IF(ISNUMBER(SEARCH(\"Surveys with experts/expert opinion\",'Data extraction-synthesis'!J24)),\"X\",\"\")","v":"X"},{"$f":"IF(ISNUMBER(SEARCH(\"Consensus meeting inputs\",'Data extraction-synthesis'!J24)),\"X\",\"\")","v":""},{"$f":"IF(ISNUMBER(SEARCH(\"Available data\",'Data extraction-synthesis'!J24)),\"X\",\"\")","v":""},{"$f":"IF(ISNUMBER(SEARCH(\"Field observations\",'Data extraction-synthesis'!J24)),\"X\",\"\")","v":""},{"$f":"IF(ISNUMBER(SEARCH(\"Laboratory evaluations\",'Data extraction-synthesis'!J24)),\"X\",\"\")","v":""},{"$f":"IF(ISNUMBER(SEARCH(\"Models\",'Data extraction-synthesis'!J24)),\"X\",\"\")","v":"X"},{"$f":"IF(ISNUMBER(SEARCH(\"Early usability studies\",'Data extraction-synthesis'!J24)),\"X\",\"\")","v":""},{"$f":"IF(ISNUMBER(SEARCH(\"No input sources reported\",'Data extraction-synthesis'!J24)),\"X\",\"\")","v":""},{"$f":"IF(ISNUMBER(SEARCH(\"N/A\",'Data extraction-synthesis'!J24)),\"X\",\"\")","v":""},null,null,"YES"]
["WHO","Development of a Target Product Profile (TPP) and framework for evaluation for a test predicting progression from tubercolosis infection to active disease",{"$f":"IF(ISNUMBER(SEARCH(\"Literature\",'Data extraction-synthesis'!J25)),\"X\",\"\")","v":""},{"$f":"IF(ISNUMBER(SEARCH(\"Industry standard\",'Data extraction-synthesis'!J25)),\"X\",\"\")","v":""},{"$f":"IF(ISNUMBER(SEARCH(\"Guidelines\",'Data extraction-synthesis'!J25)),\"X\",\"\")","v":""},{"$f":"IF(ISNUMBER(SEARCH(\"Interviews with experts\",'Data extraction-synthesis'!J25)),\"X\",\"\")","v":""},{"$f":"IF(ISNUMBER(SEARCH(\"Surveys with experts/expert opinion\",'Data extraction-synthesis'!J25)),\"X\",\"\")","v":""},{"$f":"IF(ISNUMBER(SEARCH(\"Consensus meeting inputs\",'Data extraction-synthesis'!J25)),\"X\",\"\")","v":""},{"$f":"IF(ISNUMBER(SEARCH(\"Available data\",'Data extraction-synthesis'!J25)),\"X\",\"\")","v":""},{"$f":"IF(ISNUMBER(SEARCH(\"Field observations\",'Data extraction-synthesis'!J25)),\"X\",\"\")","v":""},{"$f":"IF(ISNUMBER(SEARCH(\"Laboratory evaluations\",'Data extraction-synthesis'!J25)),\"X\",\"\")","v":""},{"$f":"IF(ISNUMBER(SEARCH(\"Models\",'Data extraction-synthesis'!J25)),\"X\",\"\")","v":""},{"$f":"IF(ISNUMBER(SEARCH(\"Early usability studies\",'Data extraction-synthesis'!J25)),\"X\",\"\")","v":""},{"$f":"IF(ISNUMBER(SEARCH(\"No input sources reported\",'Data extraction-synthesis'!J25)),\"X\",\"\")","v":""},{"$f":"IF(ISNUMBER(SEARCH(\"N/A\",'Data extraction-synthesis'!J25)),\"X\",\"\")","v":"X"},null,null,"N/A"]
["WHO","Specifications for a rapid diagnostic test for meningitis African meningitis belt/ Target product profile for the development of a new generation of rapid test for the diagnosis of bacterial meningitis",{"$f":"IF(ISNUMBER(SEARCH(\"Literature\",'Data extraction-synthesis'!J26)),\"X\",\"\")","v":""},{"$f":"IF(ISNUMBER(SEARCH(\"Industry standard\",'Data extraction-synthesis'!J26)),\"X\",\"\")","v":""},{"$f":"IF(ISNUMBER(SEARCH(\"Guidelines\",'Data extraction-synthesis'!J26)),\"X\",\"\")","v":""},{"$f":"IF(ISNUMBER(SEARCH(\"Interviews with experts\",'Data extraction-synthesis'!J26)),\"X\",\"\")","v":""},{"$f":"IF(ISNUMBER(SEARCH(\"Surveys with experts/expert opinion\",'Data extraction-synthesis'!J26)),\"X\",\"\")","v":""},{"$f":"IF(ISNUMBER(SEARCH(\"Consensus meeting inputs\",'Data extraction-synthesis'!J26)),\"X\",\"\")","v":""},{"$f":"IF(ISNUMBER(SEARCH(\"Available data\",'Data extraction-synthesis'!J26)),\"X\",\"\")","v":""},{"$f":"IF(ISNUMBER(SEARCH(\"Field observations\",'Data extraction-synthesis'!J26)),\"X\",\"\")","v":""},{"$f":"IF(ISNUMBER(SEARCH(\"Laboratory evaluations\",'Data extraction-synthesis'!J26)),\"X\",\"\")","v":""},{"$f":"IF(ISNUMBER(SEARCH(\"Models\",'Data extraction-synthesis'!J26)),\"X\",\"\")","v":""},{"$f":"IF(ISNUMBER(SEARCH(\"Early usability studies\",'Data extraction-synthesis'!J26)),\"X\",\"\")","v":""},{"$f":"IF(ISNUMBER(SEARCH(\"No input sources reported\",'Data extraction-synthesis'!J26)),\"X\",\"\")","v":"X"},{"$f":"IF(ISNUMBER(SEARCH(\"N/A\",'Data extraction-synthesis'!J26)),\"X\",\"\")","v":""},null,null,"N/A"]
["WHO","Target Product Profile for Zaire ebolavirus rapid,simple test to be used in the control of the Ebola outbreak in West Africa",{"$f":"IF(ISNUMBER(SEARCH(\"Literature\",'Data extraction-synthesis'!J27)),\"X\",\"\")","v":""},{"$f":"IF(ISNUMBER(SEARCH(\"Industry standard\",'Data extraction-synthesis'!J27)),\"X\",\"\")","v":""},{"$f":"IF(ISNUMBER(SEARCH(\"Guidelines\",'Data extraction-synthesis'!J27)),\"X\",\"\")","v":""},{"$f":"IF(ISNUMBER(SEARCH(\"Interviews with experts\",'Data extraction-synthesis'!J27)),\"X\",\"\")","v":""},{"$f":"IF(ISNUMBER(SEARCH(\"Surveys with experts/expert opinion\",'Data extraction-synthesis'!J27)),\"X\",\"\")","v":""},{"$f":"IF(ISNUMBER(SEARCH(\"Consensus meeting inputs\",'Data extraction-synthesis'!J27)),\"X\",\"\")","v":""},{"$f":"IF(ISNUMBER(SEARCH(\"Available data\",'Data extraction-synthesis'!J27)),\"X\",\"\")","v":""},{"$f":"IF(ISNUMBER(SEARCH(\"Field observations\",'Data extraction-synthesis'!J27)),\"X\",\"\")","v":""},{"$f":"IF(ISNUMBER(SEARCH(\"Laboratory evaluations\",'Data extraction-synthesis'!J27)),\"X\",\"\")","v":""},{"$f":"IF(ISNUMBER(SEARCH(\"Models\",'Data extraction-synthesis'!J27)),\"X\",\"\")","v":""},{"$f":"IF(ISNUMBER(SEARCH(\"Early usability studies\",'Data extraction-synthesis'!J27)),\"X\",\"\")","v":""},{"$f":"IF(ISNUMBER(SEARCH(\"No input sources reported\",'Data extraction-synthesis'!J27)),\"X\",\"\")","v":"X"},{"$f":"IF(ISNUMBER(SEARCH(\"N/A\",'Data extraction-synthesis'!J27)),\"X\",\"\")","v":""},null,null,"N/A"]
["WHO","Report of WHO-FIND meeting on diagnostics for Buruli ulcer",{"$f":"IF(ISNUMBER(SEARCH(\"Literature\",'Data extraction-synthesis'!J28)),\"X\",\"\")","v":""},{"$f":"IF(ISNUMBER(SEARCH(\"Industry standard\",'Data extraction-synthesis'!J28)),\"X\",\"\")","v":""},{"$f":"IF(ISNUMBER(SEARCH(\"Guidelines\",'Data extraction-synthesis'!J28)),\"X\",\"\")","v":""},{"$f":"IF(ISNUMBER(SEARCH(\"Interviews with experts\",'Data extraction-synthesis'!J28)),\"X\",\"\")","v":""},{"$f":"IF(ISNUMBER(SEARCH(\"Surveys with experts/expert opinion\",'Data extraction-synthesis'!J28)),\"X\",\"\")","v":""},{"$f":"IF(ISNUMBER(SEARCH(\"Consensus meeting inputs\",'Data extraction-synthesis'!J28)),\"X\",\"\")","v":""},{"$f":"IF(ISNUMBER(SEARCH(\"Available data\",'Data extraction-synthesis'!J28)),\"X\",\"\")","v":""},{"$f":"IF(ISNUMBER(SEARCH(\"Field observations\",'Data extraction-synthesis'!J28)),\"X\",\"\")","v":""},{"$f":"IF(ISNUMBER(SEARCH(\"Laboratory evaluations\",'Data extraction-synthesis'!J28)),\"X\",\"\")","v":""},{"$f":"IF(ISNUMBER(SEARCH(\"Models\",'Data extraction-synthesis'!J28)),\"X\",\"\")","v":""},{"$f":"IF(ISNUMBER(SEARCH(\"Early usability studies\",'Data extraction-synthesis'!J28)),\"X\",\"\")","v":""},{"$f":"IF(ISNUMBER(SEARCH(\"No input sources reported\",'Data extraction-synthesis'!J28)),\"X\",\"\")","v":""},{"$f":"IF(ISNUMBER(SEARCH(\"N/A\",'Data extraction-synthesis'!J28)),\"X\",\"\")","v":"X"},null,null,"N/A"]
["WHO","Taenia solium taeniasis/cysticercosis diagnostic tools. Report of a stakeholder meeting",{"$f":"IF(ISNUMBER(SEARCH(\"Literature\",'Data extraction-synthesis'!J29)),\"X\",\"\")","v":""},{"$f":"IF(ISNUMBER(SEARCH(\"Industry standard\",'Data extraction-synthesis'!J29)),\"X\",\"\")","v":""},{"$f":"IF(ISNUMBER(SEARCH(\"Guidelines\",'Data extraction-synthesis'!J29)),\"X\",\"\")","v":""},{"$f":"IF(ISNUMBER(SEARCH(\"Interviews with experts\",'Data extraction-synthesis'!J29)),\"X\",\"\")","v":""},{"$f":"IF(ISNUMBER(SEARCH(\"Surveys with experts/expert opinion\",'Data extraction-synthesis'!J29)),\"X\",\"\")","v":""},{"$f":"IF(ISNUMBER(SEARCH(\"Consensus meeting inputs\",'Data extraction-synthesis'!J29)),\"X\",\"\")","v":""},{"$f":"IF(ISNUMBER(SEARCH(\"Available data\",'Data extraction-synthesis'!J29)),\"X\",\"\")","v":""},{"$f":"IF(ISNUMBER(SEARCH(\"Field observations\",'Data extraction-synthesis'!J29)),\"X\",\"\")","v":""},{"$f":"IF(ISNUMBER(SEARCH(\"Laboratory evaluations\",'Data extraction-synthesis'!J29)),\"X\",\"\")","v":""},{"$f":"IF(ISNUMBER(SEARCH(\"Models\",'Data extraction-synthesis'!J29)),\"X\",\"\")","v":""},{"$f":"IF(ISNUMBER(SEARCH(\"Early usability studies\",'Data extraction-synthesis'!J29)),\"X\",\"\")","v":""},{"$f":"IF(ISNUMBER(SEARCH(\"No input sources reported\",'Data extraction-synthesis'!J29)),\"X\",\"\")","v":""},{"$f":"IF(ISNUMBER(SEARCH(\"N/A\",'Data extraction-synthesis'!J29)),\"X\",\"\")","v":"X"},null,null,"N/A"]
["WHO, FIND, Medecins sans Frontiers","A Multiplex Multi-Analyte Diagnostic Platform",{"$f":"IF(ISNUMBER(SEARCH(\"Literature\",'Data extraction-synthesis'!J45)),\"X\",\"\")","v":""},{"$f":"IF(ISNUMBER(SEARCH(\"Industry standard\",'Data extraction-synthesis'!J45)),\"X\",\"\")","v":""},{"$f":"IF(ISNUMBER(SEARCH(\"Guidelines\",'Data extraction-synthesis'!J45)),\"X\",\"\")","v":""},{"$f":"IF(ISNUMBER(SEARCH(\"Interviews with experts\",'Data extraction-synthesis'!J45)),\"X\",\"\")","v":""},{"$f":"IF(ISNUMBER(SEARCH(\"Surveys with experts/expert opinion\",'Data extraction-synthesis'!J45)),\"X\",\"\")","v":""},{"$f":"IF(ISNUMBER(SEARCH(\"Consensus meeting inputs\",'Data extraction-synthesis'!J45)),\"X\",\"\")","v":""},{"$f":"IF(ISNUMBER(SEARCH(\"Available data\",'Data extraction-synthesis'!J45)),\"X\",\"\")","v":""},{"$f":"IF(ISNUMBER(SEARCH(\"Field observations\",'Data extraction-synthesis'!J45)),\"X\",\"\")","v":""},{"$f":"IF(ISNUMBER(SEARCH(\"Laboratory evaluations\",'Data extraction-synthesis'!J45)),\"X\",\"\")","v":""},{"$f":"IF(ISNUMBER(SEARCH(\"Models\",'Data extraction-synthesis'!J45)),\"X\",\"\")","v":""},{"$f":"IF(ISNUMBER(SEARCH(\"Early usability studies\",'Data extraction-synthesis'!J45)),\"X\",\"\")","v":""},{"$f":"IF(ISNUMBER(SEARCH(\"No input sources reported\",'Data extraction-synthesis'!J45)),\"X\",\"\")","v":"X"},{"$f":"IF(ISNUMBER(SEARCH(\"N/A\",'Data extraction-synthesis'!J45)),\"X\",\"\")","v":""},null,null,"N/A"]
[null,"TOT",{"$f":"COUNTIF(C3:C46,\"X\")","v":15},0,0,0,6,1,0,0,1,6,0,16,10]
[null,null,{"$f":"C47/44","v":{"v":0.3409090909090909,"d":"34%"}},{"v":0,"d":"0%"},{"v":0,"d":"0%"},{"v":0,"d":"0%"},{"v":0.13636363636363635,"d":"14%"},{"v":0.022727272727272728,"d":"2%"},{"v":0,"d":"0%"},{"v":0,"d":"0%"},{"v":0.022727272727272728,"d":"2%"},{"v":0.13636363636363635,"d":"14%"},{"v":0,"d":"0%"},{"v":0.36363636363636365,"d":"36%"},{"v":0.22727272727272727,"d":"23%"}]
[null,"AAS (n)"]
[null,"Conflicts?",{"$f":"IF(C47=C49,\"\",\"YES\")","v":"YES"},{"$f":"IF(D47=D49,\"\",\"YES\")","v":""},"","","YES","YES","","","YES","YES","","YES","YES"]
[null,null,"MAYBE I HAVE TO RESCALE PERCENTAGES INTO 100%?"]
[null,null,{"$f":"C47/20","v":{"v":0.75,"d":"75%"}},{"$f":"D47/20","v":{"v":0,"d":"0%"}},{"v":0,"d":"0%"},{"v":0,"d":"0%"},{"v":0.3,"d":"30%"},{"v":0.05,"d":"5%"},{"v":0,"d":"0%"},{"v":0,"d":"0%"},{"v":0.05,"d":"5%"},{"v":0.3,"d":"30%"},{"v":0,"d":"0%"},{"v":0.8,"d":"80%"}]
[]
[null,null,"Analytical accuracy"]
[null,null,12,0,0,0,4,0,2,0,1,2,1,18,9]
[null,null,{"v":0.2727272727272727,"d":"27%"},{"v":0,"d":"0%"},{"v":0,"d":"0%"},{"v":0,"d":"0%"},{"v":0.09090909090909091,"d":"9%"},{"v":0,"d":"0%"},{"v":0.045454545454545456,"d":"5%"},{"v":0,"d":"0%"},{"v":0.022727272727272728,"d":"2%"},{"v":0.045454545454545456,"d":"5%"},{"v":0.022727272727272728,"d":"2%"},{"v":0.4090909090909091,"d":"41%"},{"v":0.20454545454545456,"d":"20%"}]

{"sheet":"Decision-making steps","index":5,"n_rows":48,"n_cols":28,"rows_kept":48,"merged":[[0,2,0,27]]}
[null,null,"Decision-making steps to develop a TPP"]
["Authors","Article title","Consensus/public meeting","Meeting with experts/stakeholders ","Feedback from the consultation (e.g. survey, meeting, expert opinion) is incorporated into the final TPPs","Mapping  ","Market analyses ","Literature search ","Survey to retrieve input relevant for TPP ","Landscaping exercise ","Draft TPP","Round of revisions of TPP","Draft shortened TPP","Presentation of shortened TPP to large stakeholder audience","Identification of most important needs","Prioritization exercise ","Delphi-like approach to gauge stakeholders’ agreement with the TPP","Data analysis","Definition problem statement/use case  ","Identification of stakeholders to involve in draft TPP ","Definition TPP domains ","Survey to measure stakeholder’s preferences and agreement ","Reviewing available literature and data","Defining scope TPP ","Interview with stakeholders","Field research ","Consolidation of findings","N/A "]
["Chua, A. P., I.: Nuebling, C. M.: Wood, D.: Moussy, F.","Update on Zika Diagnostic Tests and WHO's Related Activities",{"$f":"IF(ISNUMBER(SEARCH(\"Consensus/public meeting\",'Data extraction-synthesis'!L2)),\"X\",\"\")","v":"X"},{"$f":"IF(ISNUMBER(SEARCH(\"Meeting with experts/stakeholders\",'Data extraction-synthesis'!L2)),\"X\",\"\")","v":"X"},{"$f":"IF(ISNUMBER(SEARCH(\"Feedback from the consultation (e.g. survey, meeting, expert opinion) is incorporated into the final TPPs\",'Data extraction-synthesis'!L2)),\"X\",\"\")","v":"X"},{"$f":"IF(ISNUMBER(SEARCH(\"Mapping\",'Data extraction-synthesis'!L2)),\"X\",\"\")","v":""},{"$f":"IF(ISNUMBER(SEARCH(\"Market analyses\",'Data extraction-synthesis'!L2)),\"X\",\"\")","v":""},{"$f":"IF(ISNUMBER(SEARCH(\"Literature search\",'Data extraction-synthesis'!L2)),\"X\",\"\")","v":""},{"$f":"IF(ISNUMBER(SEARCH(\"Survey to retrieve input relevant for TPP\",'Data extraction-synthesis'!L2)),\"X\",\"\")","v":""},{"$f":"IF(ISNUMBER(SEARCH(\"Landscaping exercise\",'Data extraction-synthesis'!L2)),\"X\",\"\")","v":""},{"$f":"IF(ISNUMBER(SEARCH(\"Draft TPP\",'Data extraction-synthesis'!L2)),\"X\",\"\")","v":"X"},{"$f":"IF(ISNUMBER(SEARCH(\"Round of revisions of TPP\",'Data extraction-synthesis'!L2)),\"X\",\"\")","v":""},{"$f":"IF(ISNUMBER(SEARCH(\"Draft shortened TPP\",'Data extraction-synthesis'!L2)),\"X\",\"\")","v":""},{"$f":"IF(ISNUMBER(SEARCH(\"Presentation of shortened TPP to large stakeholder audience\",'Data extraction-synthesis'!L2)),\"X\",\"\")","v":""},{"$f":"IF(ISNUMBER(SEARCH(\"Identification of most important needs\",'Data extraction-synthesis'!L2)),\"X\",\"\")","v":""},{"$f":"IF(ISNUMBER(SEARCH(\"Prioritization exercise\",'Data extraction-synthesis'!L2)),\"X\",\"\")","v":""},{"$f":"IF(ISNUMBER(SEARCH(\"Delphi-like approach to gauge stakeholders’ agreement with the TPP\",'Data extraction-synthesis'!L2)),\"X\",\"\")","v":""},{"$f":"IF(ISNUMBER(SEARCH(\"Data analysis\",'Data extraction-synthesis'!L2)),\"X\",\"\")","v":""},{"$f":"IF(ISNUMBER(SEARCH(\"Definition problem statement/use case  \",'Data extraction-synthesis'!L2)),\"X\",\"\")","v":""},{"$f":"IF(ISNUMBER(SEARCH(\"Identification of stakeholders to involve in draft TPP \",'Data extraction-synthesis'!L2)),\"X\",\"\")","v":""},{"$f":"IF(ISNUMBER(SEARCH(\"Definition TPP domains \",'Data extraction-synthesis'!L2)),\"X\",\"\")","v":""},{"$f":"IF(ISNUMBER(SEARCH(\"Survey to measure stakeholder’s preferences and agreement \",'Data extraction-synthesis'!L2)),\"X\",\"\")","v":""},{"$f":"IF(ISNUMBER(SEARCH(\"Reviewing available literature and data\",'Data extraction-synthesis'!L2)),\"X\",\"\")","v":""},{"$f":"IF(ISNUMBER(SEARCH(\"Defining scope TPP \",'Data extraction-synthesis'!L2)),\"X\",\"\")","v":""},{"$f":"IF(ISNUMBER(SEARCH(\"Interview with stakeholders\",'Data extraction-synthesis'!L2)),\"X\",\"\")","v":""},{"$f":"IF(ISNUMBER(SEARCH(\"Field research \",'Data extraction-synthesis'!L2)),\"X\",\"\")","v":""},{"$f":"IF(ISNUMBER(SEARCH(\"Consolidation of findings\",'Data extraction-synthesis'!L2)),\"X\",\"\")","v":""},{"$f":"IF(ISNUMBER(SEARCH(\"N/A\",'Data extraction-synthesis'!L2)),\"X\",\"\")","v":""}]
["Denkinger, C. M. D., D.: Schito, M.: Wells, W.: Cobelens, F.: Pai, M.: Zignol, M.: Cirillo, D. M.: Alland, D.: Casenghi, M.: Gallarda, J.: Boehme, C. C.: Perkins, M. D","Target Product Profile of a Molecular Drug-Susceptibility Test for Use in Microscopy Centers",{"$f":"IF(ISNUMBER(SEARCH(\"Consensus/public meeting\",'Data extraction-synthesis'!L3)),\"X\",\"\")","v":"X"},{"$f":"IF(ISNUMBER(SEARCH(\"Meeting with experts/stakeholders\",'Data extraction-synthesis'!L3)),\"X\",\"\")","v":""},{"$f":"IF(ISNUMBER(SEARCH(\"Feedback from the consultation (e.g. survey, meeting, expert opinion) is incorporated into the final TPPs\",'Data extraction-synthesis'!L3)),\"X\",\"\")","v":""},{"$f":"IF(ISNUMBER(SEARCH(\"Mapping\",'Data extraction-synthesis'!L3)),\"X\",\"\")","v":"X"},{"$f":"IF(ISNUMBER(SEARCH(\"Market analyses\",'Data extraction-synthesis'!L3)),\"X\",\"\")","v":""},{"$f":"IF(ISNUMBER(SEARCH(\"Literature search\",'Data extraction-synthesis'!L3)),\"X\",\"\")","v":""},{"$f":"IF(ISNUMBER(SEARCH(\"Survey to retrieve input relevant for TPP\",'Data extraction-synthesis'!L3)),\"X\",\"\")","v":""},{"$f":"IF(ISNUMBER(SEARCH(\"Landscaping exercise\",'Data extraction-synthesis'!L3)),\"X\",\"\")","v":"X"},{"$f":"IF(ISNUMBER(SEARCH(\"Draft TPP\",'Data extraction-synthesis'!L3)),\"X\",\"\")","v":"X"},{"$f":"IF(ISNUMBER(SEARCH(\"Round of revisions of TPP\",'Data extraction-synthesis'!L3)),\"X\",\"\")","v":"X"},{"$f":"IF(ISNUMBER(SEARCH(\"Draft shortened TPP\",'Data extraction-synthesis'!L3)),\"X\",\"\")","v":"X"},{"$f":"IF(ISNUMBER(SEARCH(\"Presentation of shortened TPP to large stakeholder audience\",'Data extraction-synthesis'!L3)),\"X\",\"\")","v":"X"},{"$f":"IF(ISNUMBER(SEARCH(\"Identification of most important needs\",'Data extraction-synthesis'!L3)),\"X\",\"\")","v":""},{"$f":"IF(ISNUMBER(SEARCH(\"Prioritization exercise\",'Data extraction-synthesis'!L3)),\"X\",\"\")","v":""},{"$f":"IF(ISNUMBER(SEARCH(\"Delphi-like approach to gauge stakeholders’ agreement with the TPP\",'Data extraction-synthesis'!L3)),\"X\",\"\")","v":""},{"$f":"IF(ISNUMBER(SEARCH(\"Data analysis\",'Data extraction-synthesis'!L3)),\"X\",\"\")","v":""},{"$f":"IF(ISNUMBER(SEARCH(\"Definition problem statement/use case  \",'Data extraction-synthesis'!L3)),\"X\",\"\")","v":""},{"$f":"IF(ISNUMBER(SEARCH(\"Identification of stakeholders to involve in draft TPP \",'Data extraction-synthesis'!L3)),\"X\",\"\")","v":""},{"$f":"IF(ISNUMBER(SEARCH(\"Definition TPP domains \",'Data extraction-synthesis'!L3)),\"X\",\"\")","v":""},{"$f":"IF(ISNUMBER(SEARCH(\"Survey to measure stakeholder’s preferences and agreement \",'Data extraction-synthesis'!L3)),\"X\",\"\")","v":"X"},{"$f":"IF(ISNUMBER(SEARCH(\"Reviewing available literature and data\",'Data extraction-synthesis'!L3)),\"X\",\"\")","v":""},{"$f":"IF(ISNUMBER(SEARCH(\"Defining scope TPP \",'Data extraction-synthesis'!L3)),\"X\",\"\")","v":""},{"$f":"IF(ISNUMBER(SEARCH(\"Interview with stakeholders\",'Data extraction-synthesis'!L3)),\"X\",\"\")","v":""},{"$f":"IF(ISNUMBER(SEARCH(\"Field research \",'Data extraction-synthesis'!L3)),\"X\",\"\")","v":""},{"$f":"IF(ISNUMBER(SEARCH(\"Consolidation of findings\",'Data extraction-synthesis'!L3)),\"X\",\"\")","v":""},{"$f":"IF(ISNUMBER(SEARCH(\"N/A\",'Data extraction-synthesis'!L3)),\"X\",\"\")","v":""}]
["Denkinger, C. M. K., Sandra V.: Cirillo, Daniela Maria: Casenghi, Martina: Shinnick, Thomas: Weyer, Karin: Gilpin, Chris: Boehme, Catharina C.: Schito, Marco: Kimerling, Michael: Pai, Madhuka","Defining the needs for next generation assays for tuberculosis",{"$f":"IF(ISNUMBER(SEARCH(\"Consensus/public meeting\",'Data extraction-synthesis'!L4)),\"X\",\"\")","v":"X"},{"$f":"IF(ISNUMBER(SEARCH(\"Meeting with experts/stakeholders\",'Data extraction-synthesis'!L4)),\"X\",\"\")","v":""},{"$f":"IF(ISNUMBER(SEARCH(\"Feedback from the consultation (e.g. survey, meeting, expert opinion) is incorporated into the final TPPs\",'Data extraction-synthesis'!L4)),\"X\",\"\")","v":""},{"$f":"IF(ISNUMBER(SEARCH(\"Mapping\",'Data extraction-synthesis'!L4)),\"X\",\"\")","v":""},{"$f":"IF(ISNUMBER(SEARCH(\"Market analyses\",'Data extraction-synthesis'!L4)),\"X\",\"\")","v":""},{"$f":"IF(ISNUMBER(SEARCH(\"Literature search\",'Data extraction-synthesis'!L4)),\"X\",\"\")","v":""},{"$f":"IF(ISNUMBER(SEARCH(\"Survey to retrieve input relevant for TPP\",'Data extraction-synthesis'!L4)),\"X\",\"\")","v":""},{"$f":"IF(ISNUMBER(SEARCH(\"Landscaping exercise\",'Data extraction-synthesis'!L4)),\"X\",\"\")","v":""},{"$f":"IF(ISNUMBER(SEARCH(\"Draft TPP\",'Data extraction-synthesis'!L4)),\"X\",\"\")","v":"X"},{"$f":"IF(ISNUMBER(SEARCH(\"Round of revisions of TPP\",'Data extraction-synthesis'!L4)),\"X\",\"\")","v":"X"},{"$f":"IF(ISNUMBER(SEARCH(\"Draft shortened TPP\",'Data extraction-synthesis'!L4)),\"X\",\"\")","v":"X"},{"$f":"IF(ISNUMBER(SEARCH(\"Presentation of shortened TPP to large stakeholder audience\",'Data extraction-synthesis'!L4)),\"X\",\"\")","v":"X"},{"$f":"IF(ISNUMBER(SEARCH(\"Identification of most important needs\",'Data extraction-synthesis'!L4)),\"X\",\"\")","v":""},{"$f":"IF(ISNUMBER(SEARCH(\"Prioritization exercise\",'Data extraction-synthesis'!L4)),\"X\",\"\")","v":"X"},{"$f":"IF(ISNUMBER(SEARCH(\"Delphi-like approach to gauge stakeholders’ agreement with the TPP\",'Data extraction-synthesis'!L4)),\"X\",\"\")","v":"X"},{"$f":"IF(ISNUMBER(SEARCH(\"Data analysis\",'Data extraction-synthesis'!L4)),\"X\",\"\")","v":""},{"$f":"IF(ISNUMBER(SEARCH(\"Definition problem statement/use case  \",'Data extraction-synthesis'!L4)),\"X\",\"\")","v":"X"},{"$f":"IF(ISNUMBER(SEARCH(\"Identification of stakeholders to involve in draft TPP \",'Data extraction-synthesis'!L4)),\"X\",\"\")","v":""},{"$f":"IF(ISNUMBER(SEARCH(\"Definition TPP domains \",'Data extraction-synthesis'!L4)),\"X\",\"\")","v":""},{"$f":"IF(ISNUMBER(SEARCH(\"Survey to measure stakeholder’s preferences and agreement \",'Data extraction-synthesis'!L4)),\"X\",\"\")","v":""},{"$f":"IF(ISNUMBER(SEARCH(\"Reviewing available literature and data\",'Data extraction-synthesis'!L4)),\"X\",\"\")","v":""},{"$f":"IF(ISNUMBER(SEARCH(\"Defining scope TPP \",'Data extraction-synthesis'!L4)),\"X\",\"\")","v":""},{"$f":"IF(ISNUMBER(SEARCH(\"Interview with stakeholders\",'Data extraction-synthesis'!L4)),\"X\",\"\")","v":""},{"$f":"IF(ISNUMBER(SEARCH(\"Field research \",'Data extraction-synthesis'!L4)),\"X\",\"\")","v":""},{"$f":"IF(ISNUMBER(SEARCH(\"Consolidation of findings\",'Data extraction-synthesis'!L4)),\"X\",\"\")","v":""},{"$f":"IF(ISNUMBER(SEARCH(\"N/A\",'Data extraction-synthesis'!L4)),\"X\",\"\")","v":""}]
["DIAMETER Project, PATH","Point-of-Care Malaria Infection Detection Test For rapid detection of low-density, subclinical malaria infections",{"$f":"IF(ISNUMBER(SEARCH(\"Consensus/public meeting\",'Data extraction-synthesis'!L5)),\"X\",\"\")","v":""},{"$f":"IF(ISNUMBER(SEARCH(\"Meeting with experts/stakeholders\",'Data extraction-synthesis'!L5)),\"X\",\"\")","v":""},{"$f":"IF(ISNUMBER(SEARCH(\"Feedback from the consultation (e.g. survey, meeting, expert opinion) is incorporated into the final TPPs\",'Data extraction-synthesis'!L5)),\"X\",\"\")","v":""},{"$f":"IF(ISNUMBER(SEARCH(\"Mapping\",'Data extraction-synthesis'!L5)),\"X\",\"\")","v":""},{"$f":"IF(ISNUMBER(SEARCH(\"Market analyses\",'Data extraction-synthesis'!L5)),\"X\",\"\")","v":""},{"$f":"IF(ISNUMBER(SEARCH(\"Literature search\",'Data extraction-synthesis'!L5)),\"X\",\"\")","v":""},{"$f":"IF(ISNUMBER(SEARCH(\"Survey to retrieve input relevant for TPP\",'Data extraction-synthesis'!L5)),\"X\",\"\")","v":""},{"$f":"IF(ISNUMBER(SEARCH(\"Landscaping exercise\",'Data extraction-synthesis'!L5)),\"X\",\"\")","v":""},{"$f":"IF(ISNUMBER(SEARCH(\"Draft TPP\",'Data extraction-synthesis'!L5)),\"X\",\"\")","v":""},{"$f":"IF(ISNUMBER(SEARCH(\"Round of revisions of TPP\",'Data extraction-synthesis'!L5)),\"X\",\"\")","v":""},{"$f":"IF(ISNUMBER(SEARCH(\"Draft shortened TPP\",'Data extraction-synthesis'!L5)),\"X\",\"\")","v":""},{"$f":"IF(ISNUMBER(SEARCH(\"Presentation of shortened TPP to large stakeholder audience\",'Data extraction-synthesis'!L5)),\"X\",\"\")","v":""},{"$f":"IF(ISNUMBER(SEARCH(\"Identification of most important needs\",'Data extraction-synthesis'!L5)),\"X\",\"\")","v":""},{"$f":"IF(ISNUMBER(SEARCH(\"Prioritization exercise\",'Data extraction-synthesis'!L5)),\"X\",\"\")","v":""},{"$f":"IF(ISNUMBER(SEARCH(\"Delphi-like approach to gauge stakeholders’ agreement with the TPP\",'Data extraction-synthesis'!L5)),\"X\",\"\")","v":""},{"$f":"IF(ISNUMBER(SEARCH(\"Data analysis\",'Data extraction-synthesis'!L5)),\"X\",\"\")","v":""},{"$f":"IF(ISNUMBER(SEARCH(\"Definition problem statement/use case  \",'Data extraction-synthesis'!L5)),\"X\",\"\")","v":""},{"$f":"IF(ISNUMBER(SEARCH(\"Identification of stakeholders to involve in draft TPP \",'Data extraction-synthesis'!L5)),\"X\",\"\")","v":""},{"$f":"IF(ISNUMBER(SEARCH(\"Definition TPP domains \",'Data extraction-synthesis'!L5)),\"X\",\"\")","v":""},{"$f":"IF(ISNUMBER(SEARCH(\"Survey to measure stakeholder’s preferences and agreement \",'Data extraction-synthesis'!L5)),\"X\",\"\")","v":""},{"$f":"IF(ISNUMBER(SEARCH(\"Reviewing available literature and data\",'Data extraction-synthesis'!L5)),\"X\",\"\")","v":""},{"$f":"IF(ISNUMBER(SEARCH(\"Defining scope TPP \",'Data extraction-synthesis'!L5)),\"X\",\"\")","v":""},{"$f":"IF(ISNUMBER(SEARCH(\"Interview with stakeholders\",'Data extraction-synthesis'!L5)),\"X\",\"\")","v":""},{"$f":"IF(ISNUMBER(SEARCH(\"Field research \",'Data extraction-synthesis'!L5)),\"X\",\"\")","v":""},{"$f":"IF(ISNUMBER(SEARCH(\"Consolidation of findings\",'Data extraction-synthesis'!L5)),\"X\",\"\")","v":""},{"$f":"IF(ISNUMBER(SEARCH(\"N/A\",'Data extraction-synthesis'!L5)),\"X\",\"\")","v":"X"}]
["Ding, X. C. A., Maria Paz: Baird, J. Kevin: Cheng, Qin: Cunningham, Jane: Dhorda, Mehul: Drakeley, Chris: Felger, Ingrid: Gamboa, Dionicia: Harbers, Matthias: Herrera, Socrates: Lucchi, Naomi: Mayor, Alfredo: Mueller, Ivo: Sattabongkot, Jetsumon: Ratsimbason, Arsène: Richards, Jack: Tanner, Marcel: González, Iveth J.","Defining the next generation of Plasmodium vivax diagnostic tests for control and elimination: Target product profiles",{"$f":"IF(ISNUMBER(SEARCH(\"Consensus/public meeting\",'Data extraction-synthesis'!L6)),\"X\",\"\")","v":""},{"$f":"IF(ISNUMBER(SEARCH(\"Meeting with experts/stakeholders\",'Data extraction-synthesis'!L6)),\"X\",\"\")","v":""},{"$f":"IF(ISNUMBER(SEARCH(\"Feedback from the consultation (e.g. survey, meeting, expert opinion) is incorporated into the final TPPs\",'Data extraction-synthesis'!L6)),\"X\",\"\")","v":""},{"$f":"IF(ISNUMBER(SEARCH(\"Mapping\",'Data extraction-synthesis'!L6)),\"X\",\"\")","v":""},{"$f":"IF(ISNUMBER(SEARCH(\"Market analyses\",'Data extraction-synthesis'!L6)),\"X\",\"\")","v":""},{"$f":"IF(ISNUMBER(SEARCH(\"Literature search\",'Data extraction-synthesis'!L6)),\"X\",\"\")","v":""},{"$f":"IF(ISNUMBER(SEARCH(\"Survey to retrieve input relevant for TPP\",'Data extraction-synthesis'!L6)),\"X\",\"\")","v":""},{"$f":"IF(ISNUMBER(SEARCH(\"Landscaping exercise\",'Data extraction-synthesis'!L6)),\"X\",\"\")","v":""},{"$f":"IF(ISNUMBER(SEARCH(\"Draft TPP\",'Data extraction-synthesis'!L6)),\"X\",\"\")","v":"X"},{"$f":"IF(ISNUMBER(SEARCH(\"Round of revisions of TPP\",'Data extraction-synthesis'!L6)),\"X\",\"\")","v":"X"},{"$f":"IF(ISNUMBER(SEARCH(\"Draft shortened TPP\",'Data extraction-synthesis'!L6)),\"X\",\"\")","v":""},{"$f":"IF(ISNUMBER(SEARCH(\"Presentation of shortened TPP to large stakeholder audience\",'Data extraction-synthesis'!L6)),\"X\",\"\")","v":""},{"$f":"IF(ISNUMBER(SEARCH(\"Identification of most important needs\",'Data extraction-synthesis'!L6)),\"X\",\"\")","v":""},{"$f":"IF(ISNUMBER(SEARCH(\"Prioritization exercise\",'Data extraction-synthesis'!L6)),\"X\",\"\")","v":""},{"$f":"IF(ISNUMBER(SEARCH(\"Delphi-like approach to gauge stakeholders’ agreement with the TPP\",'Data extraction-synthesis'!L6)),\"X\",\"\")","v":""},{"$f":"IF(ISNUMBER(SEARCH(\"Data analysis\",'Data extraction-synthesis'!L6)),\"X\",\"\")","v":""},{"$f":"IF(ISNUMBER(SEARCH(\"Definition problem statement/use case  \",'Data extraction-synthesis'!L6)),\"X\",\"\")","v":"X"},{"$f":"IF(ISNUMBER(SEARCH(\"Identification of stakeholders to involve in draft TPP \",'Data extraction-synthesis'!L6)),\"X\",\"\")","v":""},{"$f":"IF(ISNUMBER(SEARCH(\"Definition TPP domains \",'Data extraction-synthesis'!L6)),\"X\",\"\")","v":""},{"$f":"IF(ISNUMBER(SEARCH(\"Survey to measure stakeholder’s preferences and agreement \",'Data extraction-synthesis'!L6)),\"X\",\"\")","v":"X"},{"$f":"IF(ISNUMBER(SEARCH(\"Reviewing available literature and data\",'Data extraction-synthesis'!L6)),\"X\",\"\")","v":""},{"$f":"IF(ISNUMBER(SEARCH(\"Defining scope TPP \",'Data extraction-synthesis'!L6)),\"X\",\"\")","v":""},{"$f":"IF(ISNUMBER(SEARCH(\"Interview with stakeholders\",'Data extraction-synthesis'!L6)),\"X\",\"\")","v":""},{"$f":"IF(ISNUMBER(SEARCH(\"Field research \",'Data extraction-synthesis'!L6)),\"X\",\"\")","v":""},{"$f":"IF(ISNUMBER(SEARCH(\"Consolidation of findings\",'Data extraction-synthesis'!L6)),\"X\",\"\")","v":""},{"$f":"IF(ISNUMBER(SEARCH(\"N/A\",'Data extraction-synthesis'!L6)),\"X\",\"\")","v":""}]
["Dittrich, S. T., B. T.: Moussy, F.: Chua, A.: Zorzet, A.: Tangden, T.: Dolinger, D. L.: Page, A. L.: Crump, J. A.: Valerie, D.: Bassat, Q.: Lubell, Y.: Heinrich, N.: Newton, P. N.: Rodwell, T.: Gonzalez, I. J.","Target Product Profile for a Diagnostic Assay to Differentiate between Bacterial and Non-Bacterial Infections to Guide Antimicrobials Use in Resource-Limited Settings: An Expert Consensus",{"$f":"IF(ISNUMBER(SEARCH(\"Consensus/public meeting\",'Data extraction-synthesis'!L7)),\"X\",\"\")","v":"X"},{"$f":"IF(ISNUMBER(SEARCH(\"Meeting with experts/stakeholders\",'Data extraction-synthesis'!L7)),\"X\",\"\")","v":""},{"$f":"IF(ISNUMBER(SEARCH(\"Feedback from the consultation (e.g. survey, meeting, expert opinion) is incorporated into the final TPPs\",'Data extraction-synthesis'!L7)),\"X\",\"\")","v":"X"},{"$f":"IF(ISNUMBER(SEARCH(\"Mapping\",'Data extraction-synthesis'!L7)),\"X\",\"\")","v":""},{"$f":"IF(ISNUMBER(SEARCH(\"Market analyses\",'Data extraction-synthesis'!L7)),\"X\",\"\")","v":""},{"$f":"IF(ISNUMBER(SEARCH(\"Literature search\",'Data extraction-synthesis'!L7)),\"X\",\"\")","v":""},{"$f":"IF(ISNUMBER(SEARCH(\"Survey to retrieve input relevant for TPP\",'Data extraction-synthesis'!L7)),\"X\",\"\")","v":""},{"$f":"IF(ISNUMBER(SEARCH(\"Landscaping exercise\",'Data extraction-synthesis'!L7)),\"X\",\"\")","v":"X"},{"$f":"IF(ISNUMBER(SEARCH(\"Draft TPP\",'Data extraction-synthesis'!L7)),\"X\",\"\")","v":"X"},{"$f":"IF(ISNUMBER(SEARCH(\"Round of revisions of TPP\",'Data extraction-synthesis'!L7)),\"X\",\"\")","v":"X"},{"$f":"IF(ISNUMBER(SEARCH(\"Draft shortened TPP\",'Data extraction-synthesis'!L7)),\"X\",\"\")","v":""},{"$f":"IF(ISNUMBER(SEARCH(\"Presentation of shortened TPP to large stakeholder audience\",'Data extraction-synthesis'!L7)),\"X\",\"\")","v":""},{"$f":"IF(ISNUMBER(SEARCH(\"Identification of most important needs\",'Data extraction-synthesis'!L7)),\"X\",\"\")","v":""},null,{"$f":"IF(ISNUMBER(SEARCH(\"Delphi-like approach to gauge stakeholders’ agreement with the TPP\",'Data extraction-synthesis'!L7)),\"X\",\"\")","v":"X"},{"$f":"IF(ISNUMBER(SEARCH(\"Data analysis\",'Data extraction-synthesis'!L7)),\"X\",\"\")","v":""},{"$f":"IF(ISNUMBER(SEARCH(\"Definition problem statement/use case  \",'Data extraction-synthesis'!L7)),\"X\",\"\")","v":""},{"$f":"IF(ISNUMBER(SEARCH(\"Identification of stakeholders to involve in draft TPP \",'Data extraction-synthesis'!L7)),\"X\",\"\")","v":""},{"$f":"IF(ISNUMBER(SEARCH(\"Definition TPP domains \",'Data extraction-synthesis'!L7)),\"X\",\"\")","v":""},{"$f":"IF(ISNUMBER(SEARCH(\"Survey to measure stakeholder’s preferences and agreement \",'Data extraction-synthesis'!L7)),\"X\",\"\")","v":""},{"$f":"IF(ISNUMBER(SEARCH(\"Reviewing available literature and data\",'Data extraction-synthesis'!L7)),\"X\",\"\")","v":""},{"$f":"IF(ISNUMBER(SEARCH(\"Defining scope TPP \",'Data extraction-synthesis'!L7)),\"X\",\"\")","v":""},{"$f":"IF(ISNUMBER(SEARCH(\"Interview with stakeholders\",'Data extraction-synthesis'!L7)),\"X\",\"\")","v":""},{"$f":"IF(ISNUMBER(SEARCH(\"Field research \",'Data extraction-synthesis'!L7)),\"X\",\"\")","v":""},{"$f":"IF(ISNUMBER(SEARCH(\"Consolidation of findings\",'Data extraction-synthesis'!L7)),\"X\",\"\")","v":""},{"$f":"IF(ISNUMBER(SEARCH(\"N/A\",'Data extraction-synthesis'!L7)),\"X\",\"\")","v":""}]
["WHO","High-priority target product profile for hepatitis C diagnosis in decentralized settings: Report of a consensus meeting. ",{"$f":"IF(ISNUMBER(SEARCH(\"Consensus/public meeting\",'Data extraction-synthesis'!L8)),\"X\",\"\")","v":"X"},{"$f":"IF(ISNUMBER(SEARCH(\"Meeting with experts/stakeholders\",'Data extraction-synthesis'!L8)),\"X\",\"\")","v":""},{"$f":"IF(ISNUMBER(SEARCH(\"Feedback from the consultation (e.g. survey, meeting, expert opinion) is incorporated into the final TPPs\",'Data extraction-synthesis'!L8)),\"X\",\"\")","v":""},{"$f":"IF(ISNUMBER(SEARCH(\"Mapping\",'Data extraction-synthesis'!L8)),\"X\",\"\")","v":""},{"$f":"IF(ISNUMBER(SEARCH(\"Market analyses\",'Data extraction-synthesis'!L8)),\"X\",\"\")","v":""},{"$f":"IF(ISNUMBER(SEARCH(\"Literature search\",'Data extraction-synthesis'!L8)),\"X\",\"\")","v":""},{"$f":"IF(ISNUMBER(SEARCH(\"Survey to retrieve input relevant for TPP\",'Data extraction-synthesis'!L8)),\"X\",\"\")","v":""},{"$f":"IF(ISNUMBER(SEARCH(\"Landscaping exercise\",'Data extraction-synthesis'!L8)),\"X\",\"\")","v":""},{"$f":"IF(ISNUMBER(SEARCH(\"Draft TPP\",'Data extraction-synthesis'!L8)),\"X\",\"\")","v":"X"},{"$f":"IF(ISNUMBER(SEARCH(\"Round of revisions of TPP\",'Data extraction-synthesis'!L8)),\"X\",\"\")","v":""},{"$f":"IF(ISNUMBER(SEARCH(\"Draft shortened TPP\",'Data extraction-synthesis'!L8)),\"X\",\"\")","v":"X"},{"$f":"IF(ISNUMBER(SEARCH(\"Presentation of shortened TPP to large stakeholder audience\",'Data extraction-synthesis'!L8)),\"X\",\"\")","v":""},{"$f":"IF(ISNUMBER(SEARCH(\"Identification of most important needs\",'Data extraction-synthesis'!L8)),\"X\",\"\")","v":""},{"$f":"IF(ISNUMBER(SEARCH(\"Prioritization exercise\",'Data extraction-synthesis'!L8)),\"X\",\"\")","v":"X"},{"$f":"IF(ISNUMBER(SEARCH(\"Delphi-like approach to gauge stakeholders’ agreement with the TPP\",'Data extraction-synthesis'!L8)),\"X\",\"\")","v":"X"},{"$f":"IF(ISNUMBER(SEARCH(\"Data analysis\",'Data extraction-synthesis'!L8)),\"X\",\"\")","v":""},{"$f":"IF(ISNUMBER(SEARCH(\"Definition problem statement/use case  \",'Data extraction-synthesis'!L8)),\"X\",\"\")","v":""},{"$f":"IF(ISNUMBER(SEARCH(\"Identification of stakeholders to involve in draft TPP \",'Data extraction-synthesis'!L8)),\"X\",\"\")","v":""},{"$f":"IF(ISNUMBER(SEARCH(\"Definition TPP domains \",'Data extraction-synthesis'!L8)),\"X\",\"\")","v":""},{"$f":"IF(ISNUMBER(SEARCH(\"Survey to measure stakeholder’s preferences and agreement \",'Data extraction-synthesis'!L8)),\"X\",\"\")","v":""},{"$f":"IF(ISNUMBER(SEARCH(\"Reviewing available literature and data\",'Data extraction-synthesis'!L8)),\"X\",\"\")","v":""},{"$f":"IF(ISNUMBER(SEARCH(\"Defining scope TPP \",'Data extraction-synthesis'!L8)),\"X\",\"\")","v":""},{"$f":"IF(ISNUMBER(SEARCH(\"Interview with stakeholders\",'Data extraction-synthesis'!L8)),\"X\",\"\")","v":""},{"$f":"IF(ISNUMBER(SEARCH(\"Field research \",'Data extraction-synthesis'!L8)),\"X\",\"\")","v":""},{"$f":"IF(ISNUMBER(SEARCH(\"Consolidation of findings\",'Data extraction-synthesis'!L8)),\"X\",\"\")","v":""},{"$f":"IF(ISNUMBER(SEARCH(\"N/A\",'Data extraction-synthesis'!L8)),\"X\",\"\")","v":""}]
["Gal, M. F., N. A.: Hood, K.: Villacian, J.: Goossens, H.: Watkins, A.: Butler, C. C.","Matching diagnostics development to clinical need: Target product profile development for a point of care test for community-acquired lower respiratory tract infection",{"$f":"IF(ISNUMBER(SEARCH(\"Consensus/public meeting\",'Data extraction-synthesis'!L9)),\"X\",\"\")","v":""},{"$f":"IF(ISNUMBER(SEARCH(\"Meeting with experts/stakeholders\",'Data extraction-synthesis'!L9)),\"X\",\"\")","v":"X"},{"$f":"IF(ISNUMBER(SEARCH(\"Feedback from the consultation (e.g. survey, meeting, expert opinion) is incorporated into the final TPPs\",'Data extraction-synthesis'!L9)),\"X\",\"\")","v":"X"},{"$f":"IF(ISNUMBER(SEARCH(\"Mapping\",'Data extraction-synthesis'!L9)),\"X\",\"\")","v":""},{"$f":"IF(ISNUMBER(SEARCH(\"Market analyses\",'Data extraction-synthesis'!L9)),\"X\",\"\")","v":""},{"$f":"IF(ISNUMBER(SEARCH(\"Literature search\",'Data extraction-synthesis'!L9)),\"X\",\"\")","v":""},{"$f":"IF(ISNUMBER(SEARCH(\"Survey to retrieve input relevant for TPP\",'Data extraction-synthesis'!L9)),\"X\",\"\")","v":"X"},{"$f":"IF(ISNUMBER(SEARCH(\"Landscaping exercise\",'Data extraction-synthesis'!L9)),\"X\",\"\")","v":""},{"$f":"IF(ISNUMBER(SEARCH(\"Draft TPP\",'Data extraction-synthesis'!L9)),\"X\",\"\")","v":"X"},{"$f":"IF(ISNUMBER(SEARCH(\"Round of revisions of TPP\",'Data extraction-synthesis'!L9)),\"X\",\"\")","v":""},{"$f":"IF(ISNUMBER(SEARCH(\"Draft shortened TPP\",'Data extraction-synthesis'!L9)),\"X\",\"\")","v":""},{"$f":"IF(ISNUMBER(SEARCH(\"Presentation of shortened TPP to large stakeholder audience\",'Data extraction-synthesis'!L9)),\"X\",\"\")","v":""},{"$f":"IF(ISNUMBER(SEARCH(\"Identification of most important needs\",'Data extraction-synthesis'!L9)),\"X\",\"\")","v":""},{"$f":"IF(ISNUMBER(SEARCH(\"Prioritization exercise\",'Data extraction-synthesis'!L9)),\"X\",\"\")","v":"X"},{"$f":"IF(ISNUMBER(SEARCH(\"Delphi-like approach to gauge stakeholders’ agreement with the TPP\",'Data extraction-synthesis'!L9)),\"X\",\"\")","v":""},{"$f":"IF(ISNUMBER(SEARCH(\"Data analysis\",'Data extraction-synthesis'!L9)),\"X\",\"\")","v":""},{"$f":"IF(ISNUMBER(SEARCH(\"Definition problem statement/use case  \",'Data extraction-synthesis'!L9)),\"X\",\"\")","v":""},{"$f":"IF(ISNUMBER(SEARCH(\"Identification of stakeholders to involve in draft TPP \",'Data extraction-synthesis'!L9)),\"X\",\"\")","v":""},{"$f":"IF(ISNUMBER(SEARCH(\"Definition TPP domains \",'Data extraction-synthesis'!L9)),\"X\",\"\")","v":""},{"$f":"IF(ISNUMBER(SEARCH(\"Survey to measure stakeholder’s preferences and agreement \",'Data extraction-synthesis'!L9)),\"X\",\"\")","v":""},{"$f":"IF(ISNUMBER(SEARCH(\"Reviewing available literature and data\",'Data extraction-synthesis'!L9)),\"X\",\"\")","v":""},{"$f":"IF(ISNUMBER(SEARCH(\"Defining scope TPP \",'Data extraction-synthesis'!L9)),\"X\",\"\")","v":""},{"$f":"IF(ISNUMBER(SEARCH(\"Interview with stakeholders\",'Data extraction-synthesis'!L9)),\"X\",\"\")","v":""},{"$f":"IF(ISNUMBER(SEARCH(\"Field research \",'Data extraction-synthesis'!L9)),\"X\",\"\")","v":""},{"$f":"IF(ISNUMBER(SEARCH(\"Consolidation of findings\",'Data extraction-synthesis'!L9)),\"X\",\"\")","v":""},{"$f":"IF(ISNUMBER(SEARCH(\"N/A\",'Data extraction-synthesis'!L9)),\"X\",\"\")","v":""}]
["Lim, M. D. B., S. J.: Belizario, V. Y., Jr.: Gay-Andrieu, F.: Gilleard, J.: Levecke, B.: Lieshout, L. van: Medley, G. F.: Mekonnen, Z.: Mirams, G.: Njenga, S. M.: Odiere, M. R.: Rudge, J. W.: Stuyver, L.: Vercruysse, J.: Vlaminck, J.: Walson, J. L. ","Diagnostic tools for soil-transmitted helminths control and elimination programs: a pathway for diagnostic product development",{"$f":"IF(ISNUMBER(SEARCH(\"Consensus/public meeting\",'Data extraction-synthesis'!L10)),\"X\",\"\")","v":""},{"$f":"IF(ISNUMBER(SEARCH(\"Meeting with experts/stakeholders\",'Data extraction-synthesis'!L10)),\"X\",\"\")","v":"X"},{"$f":"IF(ISNUMBER(SEARCH(\"Feedback from the consultation (e.g. survey, meeting, expert opinion) is incorporated into the final TPPs\",'Data extraction-synthesis'!L10)),\"X\",\"\")","v":"X"},{"$f":"IF(ISNUMBER(SEARCH(\"Mapping\",'Data extraction-synthesis'!L10)),\"X\",\"\")","v":""},{"$f":"IF(ISNUMBER(SEARCH(\"Market analyses\",'Data extraction-synthesis'!L10)),\"X\",\"\")","v":""},{"$f":"IF(ISNUMBER(SEARCH(\"Literature search\",'Data extraction-synthesis'!L10)),\"X\",\"\")","v":""},{"$f":"IF(ISNUMBER(SEARCH(\"Survey to retrieve input relevant for TPP\",'Data extraction-synthesis'!L10)),\"X\",\"\")","v":""},{"$f":"IF(ISNUMBER(SEARCH(\"Landscaping exercise\",'Data extraction-synthesis'!L10)),\"X\",\"\")","v":"X"},{"$f":"IF(ISNUMBER(SEARCH(\"Draft TPP\",'Data extraction-synthesis'!L10)),\"X\",\"\")","v":"X"},{"$f":"IF(ISNUMBER(SEARCH(\"Round of revisions of TPP\",'Data extraction-synthesis'!L10)),\"X\",\"\")","v":"X"},{"$f":"IF(ISNUMBER(SEARCH(\"Draft shortened TPP\",'Data extraction-synthesis'!L10)),\"X\",\"\")","v":""},{"$f":"IF(ISNUMBER(SEARCH(\"Presentation of shortened TPP to large stakeholder audience\",'Data extraction-synthesis'!L10)),\"X\",\"\")","v":""},{"$f":"IF(ISNUMBER(SEARCH(\"Identification of most important needs\",'Data extraction-synthesis'!L10)),\"X\",\"\")","v":""},{"$f":"IF(ISNUMBER(SEARCH(\"Prioritization exercise\",'Data extraction-synthesis'!L10)),\"X\",\"\")","v":""},{"$f":"IF(ISNUMBER(SEARCH(\"Delphi-like approach to gauge stakeholders’ agreement with the TPP\",'Data extraction-synthesis'!L10)),\"X\",\"\")","v":""},{"$f":"IF(ISNUMBER(SEARCH(\"Data analysis\",'Data extraction-synthesis'!L10)),\"X\",\"\")","v":""},{"$f":"IF(ISNUMBER(SEARCH(\"Definition problem statement/use case  \",'Data extraction-synthesis'!L10)),\"X\",\"\")","v":"X"},{"$f":"IF(ISNUMBER(SEARCH(\"Identification of stakeholders to involve in draft TPP \",'Data extraction-synthesis'!L10)),\"X\",\"\")","v":""},{"$f":"IF(ISNUMBER(SEARCH(\"Definition TPP domains \",'Data extraction-synthesis'!L10)),\"X\",\"\")","v":""},{"$f":"IF(ISNUMBER(SEARCH(\"Survey to measure stakeholder’s preferences and agreement \",'Data extraction-synthesis'!L10)),\"X\",\"\")","v":""},{"$f":"IF(ISNUMBER(SEARCH(\"Reviewing available literature and data\",'Data extraction-synthesis'!L10)),\"X\",\"\")","v":""},{"$f":"IF(ISNUMBER(SEARCH(\"Defining scope TPP \",'Data extraction-synthesis'!L10)),\"X\",\"\")","v":""},{"$f":"IF(ISNUMBER(SEARCH(\"Interview with stakeholders\",'Data extraction-synthesis'!L10)),\"X\",\"\")","v":""},{"$f":"IF(ISNUMBER(SEARCH(\"Field research \",'Data extraction-synthesis'!L10)),\"X\",\"\")","v":""},{"$f":"IF(ISNUMBER(SEARCH(\"Consolidation of findings\",'Data extraction-synthesis'!L10)),\"X\",\"\")","v":""},{"$f":"IF(ISNUMBER(SEARCH(\"N/A\",'Data extraction-synthesis'!L10)),\"X\",\"\")","v":""}]
["Nsanzabana, C. A., Frederic: Beck, Hans-Peter: Ding, Xavier C.: Kamau, Edwin: Krishna, Sanjeev: Legrand, Eric: Lucchi, Naomi: Miotto, Olivo: Nag, Sidsel: Noedl, Harald: Roper, Cally: Rosenthal, Philip J.: Schallig, Henk D. F. H.: Taylor, Steve M.: Volkman, Sarah K.: Gonzalez, Iveth J.","Molecular assays for antimalarial drug resistance surveillance: A target product profile",{"$f":"IF(ISNUMBER(SEARCH(\"Consensus/public meeting\",'Data extraction-synthesis'!L11)),\"X\",\"\")","v":"X"},{"$f":"IF(ISNUMBER(SEARCH(\"Meeting with experts/stakeholders\",'Data extraction-synthesis'!L11)),\"X\",\"\")","v":""},{"$f":"IF(ISNUMBER(SEARCH(\"Feedback from the consultation (e.g. survey, meeting, expert opinion) is incorporated into the final TPPs\",'Data extraction-synthesis'!L11)),\"X\",\"\")","v":"X"},{"$f":"IF(ISNUMBER(SEARCH(\"Mapping\",'Data extraction-synthesis'!L11)),\"X\",\"\")","v":""},{"$f":"IF(ISNUMBER(SEARCH(\"Market analyses\",'Data extraction-synthesis'!L11)),\"X\",\"\")","v":""},{"$f":"IF(ISNUMBER(SEARCH(\"Literature search\",'Data extraction-synthesis'!L11)),\"X\",\"\")","v":""},{"$f":"IF(ISNUMBER(SEARCH(\"Survey to retrieve input relevant for TPP\",'Data extraction-synthesis'!L11)),\"X\",\"\")","v":""},{"$f":"IF(ISNUMBER(SEARCH(\"Landscaping exercise\",'Data extraction-synthesis'!L11)),\"X\",\"\")","v":"X"},{"$f":"IF(ISNUMBER(SEARCH(\"Draft TPP\",'Data extraction-synthesis'!L11)),\"X\",\"\")","v":"X"},{"$f":"IF(ISNUMBER(SEARCH(\"Round of revisions of TPP\",'Data extraction-synthesis'!L11)),\"X\",\"\")","v":""},{"$f":"IF(ISNUMBER(SEARCH(\"Draft shortened TPP\",'Data extraction-synthesis'!L11)),\"X\",\"\")","v":""},{"$f":"IF(ISNUMBER(SEARCH(\"Presentation of shortened TPP to large stakeholder audience\",'Data extraction-synthesis'!L11)),\"X\",\"\")","v":""},{"$f":"IF(ISNUMBER(SEARCH(\"Identification of most important needs\",'Data extraction-synthesis'!L11)),\"X\",\"\")","v":""},{"$f":"IF(ISNUMBER(SEARCH(\"Prioritization exercise\",'Data extraction-synthesis'!L11)),\"X\",\"\")","v":""},{"$f":"IF(ISNUMBER(SEARCH(\"Delphi-like approach to gauge stakeholders’ agreement with the TPP\",'Data extraction-synthesis'!L11)),\"X\",\"\")","v":""},{"$f":"IF(ISNUMBER(SEARCH(\"Data analysis\",'Data extraction-synthesis'!L11)),\"X\",\"\")","v":""},{"$f":"IF(ISNUMBER(SEARCH(\"Definition problem statement/use case  \",'Data extraction-synthesis'!L11)),\"X\",\"\")","v":""},{"$f":"IF(ISNUMBER(SEARCH(\"Identification of stakeholders to involve in draft TPP \",'Data extraction-synthesis'!L11)),\"X\",\"\")","v":""},{"$f":"IF(ISNUMBER(SEARCH(\"Definition TPP domains \",'Data extraction-synthesis'!L11)),\"X\",\"\")","v":""},{"$f":"IF(ISNUMBER(SEARCH(\"Survey to measure stakeholder’s preferences and agreement \",'Data extraction-synthesis'!L11)),\"X\",\"\")","v":"X"},{"$f":"IF(ISNUMBER(SEARCH(\"Reviewing available literature and data\",'Data extraction-synthesis'!L11)),\"X\",\"\")","v":""},{"$f":"IF(ISNUMBER(SEARCH(\"Defining scope TPP \",'Data extraction-synthesis'!L11)),\"X\",\"\")","v":""},{"$f":"IF(ISNUMBER(SEARCH(\"Interview with stakeholders\",'Data extraction-synthesis'!L11)),\"X\",\"\")","v":""},{"$f":"IF(ISNUMBER(SEARCH(\"Field research \",'Data extraction-synthesis'!L11)),\"X\",\"\")","v":""},{"$f":"IF(ISNUMBER(SEARCH(\"Consolidation of findings\",'Data extraction-synthesis'!L11)),\"X\",\"\")","v":""},{"$f":"IF(ISNUMBER(SEARCH(\"N/A\",'Data extraction-synthesis'!L11)),\"X\",\"\")","v":""}]
["Porras, A. I. Y., Z. E.: Altcheh, J.: Britto, C.: Chaves, G. C.: Flevaud, L.: Martins, O. A.: Ribeiro, I.: Schijman, A. G.: Shikanai-Yasuda, M. A.: Sosa-Estani, S.: Stobbaerts, E.: Zicker, F.","Target Product Profile (TPP) for Chagas Disease Point-of-Care Diagnosis and Assessment of Response to Treatmen",{"$f":"IF(ISNUMBER(SEARCH(\"Consensus/public meeting\",'Data extraction-synthesis'!L12)),\"X\",\"\")","v":""},{"$f":"IF(ISNUMBER(SEARCH(\"Meeting with experts/stakeholders\",'Data extraction-synthesis'!L12)),\"X\",\"\")","v":"X"},{"$f":"IF(ISNUMBER(SEARCH(\"Feedback from the consultation (e.g. survey, meeting, expert opinion) is incorporated into the final TPPs\",'Data extraction-synthesis'!L12)),\"X\",\"\")","v":""},{"$f":"IF(ISNUMBER(SEARCH(\"Mapping\",'Data extraction-synthesis'!L12)),\"X\",\"\")","v":""},{"$f":"IF(ISNUMBER(SEARCH(\"Market analyses\",'Data extraction-synthesis'!L12)),\"X\",\"\")","v":""},{"$f":"IF(ISNUMBER(SEARCH(\"Literature search\",'Data extraction-synthesis'!L12)),\"X\",\"\")","v":""},{"$f":"IF(ISNUMBER(SEARCH(\"Survey to retrieve input relevant for TPP\",'Data extraction-synthesis'!L12)),\"X\",\"\")","v":""},{"$f":"IF(ISNUMBER(SEARCH(\"Landscaping exercise\",'Data extraction-synthesis'!L12)),\"X\",\"\")","v":""},{"$f":"IF(ISNUMBER(SEARCH(\"Draft TPP\",'Data extraction-synthesis'!L12)),\"X\",\"\")","v":"X"},{"$f":"IF(ISNUMBER(SEARCH(\"Round of revisions of TPP\",'Data extraction-synthesis'!L12)),\"X\",\"\")","v":""},{"$f":"IF(ISNUMBER(SEARCH(\"Draft shortened TPP\",'Data extraction-synthesis'!L12)),\"X\",\"\")","v":""},{"$f":"IF(ISNUMBER(SEARCH(\"Presentation of shortened TPP to large stakeholder audience\",'Data extraction-synthesis'!L12)),\"X\",\"\")","v":""},{"$f":"IF(ISNUMBER(SEARCH(\"Identification of most important needs\",'Data extraction-synthesis'!L12)),\"X\",\"\")","v":""},{"$f":"IF(ISNUMBER(SEARCH(\"Prioritization exercise\",'Data extraction-synthesis'!L12)),\"X\",\"\")","v":""},{"$f":"IF(ISNUMBER(SEARCH(\"Delphi-like approach to gauge stakeholders’ agreement with the TPP\",'Data extraction-synthesis'!L12)),\"X\",\"\")","v":""},{"$f":"IF(ISNUMBER(SEARCH(\"Data analysis\",'Data extraction-synthesis'!L12)),\"X\",\"\")","v":""},{"$f":"IF(ISNUMBER(SEARCH(\"Definition problem statement/use case  \",'Data extraction-synthesis'!L12)),\"X\",\"\")","v":"X"},{"$f":"IF(ISNUMBER(SEARCH(\"Identification of stakeholders to involve in draft TPP \",'Data extraction-synthesis'!L12)),\"X\",\"\")","v":""},{"$f":"IF(ISNUMBER(SEARCH(\"Definition TPP domains \",'Data extraction-synthesis'!L12)),\"X\",\"\")","v":""},{"$f":"IF(ISNUMBER(SEARCH(\"Survey to measure stakeholder’s preferences and agreement \",'Data extraction-synthesis'!L12)),\"X\",\"\")","v":""},{"$f":"IF(ISNUMBER(SEARCH(\"Reviewing available literature and data\",'Data extraction-synthesis'!L12)),\"X\",\"\")","v":""},{"$f":"IF(ISNUMBER(SEARCH(\"Defining scope TPP \",'Data extraction-synthesis'!L12)),\"X\",\"\")","v":""},{"$f":"IF(ISNUMBER(SEARCH(\"Interview with stakeholders\",'Data extraction-synthesis'!L12)),\"X\",\"\")","v":""},{"$f":"IF(ISNUMBER(SEARCH(\"Field research \",'Data extraction-synthesis'!L12)),\"X\",\"\")","v":""},{"$f":"IF(ISNUMBER(SEARCH(\"Consolidation of findings\",'Data extraction-synthesis'!L12)),\"X\",\"\")","v":""},{"$f":"IF(ISNUMBER(SEARCH(\"N/A\",'Data extraction-synthesis'!L12)),\"X\",\"\")","v":""}]
["Reipold, E. I. E., Philippa: Trianni, Alessandra: Panneer, Nivedha: Krakower, Douglas: Ongarello, Stefano: Roberts, Teri: Miller, Veronica: Denkinger, Claudia","Optimising diagnosis of viraemic hepatitis C infection: the development of a target product profile",{"$f":"IF(ISNUMBER(SEARCH(\"Consensus/public meeting\",'Data extraction-synthesis'!L13)),\"X\",\"\")","v":"X"},{"$f":"IF(ISNUMBER(SEARCH(\"Meeting with experts/stakeholders\",'Data extraction-synthesis'!L13)),\"X\",\"\")","v":""},{"$f":"IF(ISNUMBER(SEARCH(\"Feedback from the consultation (e.g. survey, meeting, expert opinion) is incorporated into the final TPPs\",'Data extraction-synthesis'!L13)),\"X\",\"\")","v":""},{"$f":"IF(ISNUMBER(SEARCH(\"Mapping\",'Data extraction-synthesis'!L13)),\"X\",\"\")","v":""},{"$f":"IF(ISNUMBER(SEARCH(\"Market analyses\",'Data extraction-synthesis'!L13)),\"X\",\"\")","v":""},{"$f":"IF(ISNUMBER(SEARCH(\"Literature search\",'Data extraction-synthesis'!L13)),\"X\",\"\")","v":""},{"$f":"IF(ISNUMBER(SEARCH(\"Survey to retrieve input relevant for TPP\",'Data extraction-synthesis'!L13)),\"X\",\"\")","v":""},{"$f":"IF(ISNUMBER(SEARCH(\"Landscaping exercise\",'Data extraction-synthesis'!L13)),\"X\",\"\")","v":""},{"$f":"IF(ISNUMBER(SEARCH(\"Draft TPP\",'Data extraction-synthesis'!L13)),\"X\",\"\")","v":"X"},{"$f":"IF(ISNUMBER(SEARCH(\"Round of revisions of TPP\",'Data extraction-synthesis'!L13)),\"X\",\"\")","v":""},{"$f":"IF(ISNUMBER(SEARCH(\"Draft shortened TPP\",'Data extraction-synthesis'!L13)),\"X\",\"\")","v":""},{"$f":"IF(ISNUMBER(SEARCH(\"Presentation of shortened TPP to large stakeholder audience\",'Data extraction-synthesis'!L13)),\"X\",\"\")","v":""},{"$f":"IF(ISNUMBER(SEARCH(\"Identification of most important needs\",'Data extraction-synthesis'!L13)),\"X\",\"\")","v":""},{"$f":"IF(ISNUMBER(SEARCH(\"Prioritization exercise\",'Data extraction-synthesis'!L13)),\"X\",\"\")","v":"X"},{"$f":"IF(ISNUMBER(SEARCH(\"Delphi-like approach to gauge stakeholders’ agreement with the TPP\",'Data extraction-synthesis'!L13)),\"X\",\"\")","v":"X"},{"$f":"IF(ISNUMBER(SEARCH(\"Data analysis\",'Data extraction-synthesis'!L13)),\"X\",\"\")","v":""},{"$f":"IF(ISNUMBER(SEARCH(\"Definition problem statement/use case  \",'Data extraction-synthesis'!L13)),\"X\",\"\")","v":""},{"$f":"IF(ISNUMBER(SEARCH(\"Identification of stakeholders to involve in draft TPP \",'Data extraction-synthesis'!L13)),\"X\",\"\")","v":"X"},{"$f":"IF(ISNUMBER(SEARCH(\"Definition TPP domains \",'Data extraction-synthesis'!L13)),\"X\",\"\")","v":"X"},{"$f":"IF(ISNUMBER(SEARCH(\"Survey to measure stakeholder’s preferences and agreement \",'Data extraction-synthesis'!L13)),\"X\",\"\")","v":""},{"$f":"IF(ISNUMBER(SEARCH(\"Reviewing available literature and data\",'Data extraction-synthesis'!L13)),\"X\",\"\")","v":""},{"$f":"IF(ISNUMBER(SEARCH(\"Defining scope TPP \",'Data extraction-synthesis'!L13)),\"X\",\"\")","v":""},{"$f":"IF(ISNUMBER(SEARCH(\"Interview with stakeholders\",'Data extraction-synthesis'!L13)),\"X\",\"\")","v":""},{"$f":"IF(ISNUMBER(SEARCH(\"Field research \",'Data extraction-synthesis'!L13)),\"X\",\"\")","v":""},{"$f":"IF(ISNUMBER(SEARCH(\"Consolidation of findings\",'Data extraction-synthesis'!L13)),\"X\",\"\")","v":""},{"$f":"IF(ISNUMBER(SEARCH(\"N/A\",'Data extraction-synthesis'!L13)),\"X\",\"\")","v":""}]
["Solomon, A. W. E., D.: Bailey, R. L.: Blake, I. M.: Brooker, S.: Chen, J. X.: Chen, J. H.: Churcher, T. S.: Drakeley, C. J.: Edwards, T.: Fenwick, A.: French, M.: Gabrielli, A. F.: Grassly, N. C.: Harding-Esch, E. M.: Holland, M. J.: Koukounari, A.: Lammie, P. J.: Leslie, J.: Mabey, D. C.: Rhajaoui, M.: Secor, W. E.: Stothard, J. R.: Wei, H.: Willingham, A. L.: Zhou, X. N.: Peeling, R. W.","A diagnostics platform for the integrated mapping, monitoring, and surveillance of neglected tropical diseases: Rationale and target product profiles",{"$f":"IF(ISNUMBER(SEARCH(\"Consensus/public meeting\",'Data extraction-synthesis'!L14)),\"X\",\"\")","v":""},{"$f":"IF(ISNUMBER(SEARCH(\"Meeting with experts/stakeholders\",'Data extraction-synthesis'!L14)),\"X\",\"\")","v":""},{"$f":"IF(ISNUMBER(SEARCH(\"Feedback from the consultation (e.g. survey, meeting, expert opinion) is incorporated into the final TPPs\",'Data extraction-synthesis'!L14)),\"X\",\"\")","v":""},{"$f":"IF(ISNUMBER(SEARCH(\"Mapping\",'Data extraction-synthesis'!L14)),\"X\",\"\")","v":""},{"$f":"IF(ISNUMBER(SEARCH(\"Market analyses\",'Data extraction-synthesis'!L14)),\"X\",\"\")","v":""},{"$f":"IF(ISNUMBER(SEARCH(\"Literature search\",'Data extraction-synthesis'!L14)),\"X\",\"\")","v":""},{"$f":"IF(ISNUMBER(SEARCH(\"Survey to retrieve input relevant for TPP\",'Data extraction-synthesis'!L14)),\"X\",\"\")","v":""},{"$f":"IF(ISNUMBER(SEARCH(\"Landscaping exercise\",'Data extraction-synthesis'!L14)),\"X\",\"\")","v":""},{"$f":"IF(ISNUMBER(SEARCH(\"Draft TPP\",'Data extraction-synthesis'!L14)),\"X\",\"\")","v":"X"},{"$f":"IF(ISNUMBER(SEARCH(\"Round of revisions of TPP\",'Data extraction-synthesis'!L14)),\"X\",\"\")","v":""},{"$f":"IF(ISNUMBER(SEARCH(\"Draft shortened TPP\",'Data extraction-synthesis'!L14)),\"X\",\"\")","v":""},{"$f":"IF(ISNUMBER(SEARCH(\"Presentation of shortened TPP to large stakeholder audience\",'Data extraction-synthesis'!L14)),\"X\",\"\")","v":""},{"$f":"IF(ISNUMBER(SEARCH(\"Identification of most important needs\",'Data extraction-synthesis'!L14)),\"X\",\"\")","v":""},{"$f":"IF(ISNUMBER(SEARCH(\"Prioritization exercise\",'Data extraction-synthesis'!L14)),\"X\",\"\")","v":""},{"$f":"IF(ISNUMBER(SEARCH(\"Delphi-like approach to gauge stakeholders’ agreement with the TPP\",'Data extraction-synthesis'!L14)),\"X\",\"\")","v":""},{"$f":"IF(ISNUMBER(SEARCH(\"Data analysis\",'Data extraction-synthesis'!L14)),\"X\",\"\")","v":""},{"$f":"IF(ISNUMBER(SEARCH(\"Definition problem statement/use case  \",'Data extraction-synthesis'!L14)),\"X\",\"\")","v":""},{"$f":"IF(ISNUMBER(SEARCH(\"Identification of stakeholders to involve in draft TPP \",'Data extraction-synthesis'!L14)),\"X\",\"\")","v":""},{"$f":"IF(ISNUMBER(SEARCH(\"Definition TPP domains \",'Data extraction-synthesis'!L14)),\"X\",\"\")","v":""},{"$f":"IF(ISNUMBER(SEARCH(\"Survey to measure stakeholder’s preferences and agreement \",'Data extraction-synthesis'!L14)),\"X\",\"\")","v":""},{"$f":"IF(ISNUMBER(SEARCH(\"Reviewing available literature and data\",'Data extraction-synthesis'!L14)),\"X\",\"\")","v":""},{"$f":"IF(ISNUMBER(SEARCH(\"Defining scope TPP \",'Data extraction-synthesis'!L14)),\"X\",\"\")","v":""},{"$f":"IF(ISNUMBER(SEARCH(\"Interview with stakeholders\",'Data extraction-synthesis'!L14)),\"X\",\"\")","v":""},{"$f":"IF(ISNUMBER(SEARCH(\"Field research \",'Data extraction-synthesis'!L14)),\"X\",\"\")","v":""},{"$f":"IF(ISNUMBER(SEARCH(\"Consolidation of findings\",'Data extraction-synthesis'!L14)),\"X\",\"\")","v":""},{"$f":"IF(ISNUMBER(SEARCH(\"N/A\",'Data extraction-synthesis'!L14)),\"X\",\"\")","v":""}]
["Toskin, I. M., M.: Peeling, R. W.: Blondeel, K.: Cordero, J.: Kiarie, J.","Advancing prevention of sexually transmitted infections through point-of-care testing: target product profiles and landscape analysis",{"$f":"IF(ISNUMBER(SEARCH(\"Consensus/public meeting\",'Data extraction-synthesis'!L15)),\"X\",\"\")","v":"X"},{"$f":"IF(ISNUMBER(SEARCH(\"Meeting with experts/stakeholders\",'Data extraction-synthesis'!L15)),\"X\",\"\")","v":""},{"$f":"IF(ISNUMBER(SEARCH(\"Feedback from the consultation (e.g. survey, meeting, expert opinion) is incorporated into the final TPPs\",'Data extraction-synthesis'!L15)),\"X\",\"\")","v":"X"},{"$f":"IF(ISNUMBER(SEARCH(\"Mapping\",'Data extraction-synthesis'!L15)),\"X\",\"\")","v":""},{"$f":"IF(ISNUMBER(SEARCH(\"Market analyses\",'Data extraction-synthesis'!L15)),\"X\",\"\")","v":""},{"$f":"IF(ISNUMBER(SEARCH(\"Literature search\",'Data extraction-synthesis'!L15)),\"X\",\"\")","v":""},{"$f":"IF(ISNUMBER(SEARCH(\"Survey to retrieve input relevant for TPP\",'Data extraction-synthesis'!L15)),\"X\",\"\")","v":"X"},{"$f":"IF(ISNUMBER(SEARCH(\"Landscaping exercise\",'Data extraction-synthesis'!L15)),\"X\",\"\")","v":"X"},{"$f":"IF(ISNUMBER(SEARCH(\"Draft TPP\",'Data extraction-synthesis'!L15)),\"X\",\"\")","v":"X"},{"$f":"IF(ISNUMBER(SEARCH(\"Round of revisions of TPP\",'Data extraction-synthesis'!L15)),\"X\",\"\")","v":"X"},{"$f":"IF(ISNUMBER(SEARCH(\"Draft shortened TPP\",'Data extraction-synthesis'!L15)),\"X\",\"\")","v":""},{"$f":"IF(ISNUMBER(SEARCH(\"Presentation of shortened TPP to large stakeholder audience\",'Data extraction-synthesis'!L15)),\"X\",\"\")","v":""},{"$f":"IF(ISNUMBER(SEARCH(\"Identification of most important needs\",'Data extraction-synthesis'!L15)),\"X\",\"\")","v":""},{"$f":"IF(ISNUMBER(SEARCH(\"Prioritization exercise\",'Data extraction-synthesis'!L15)),\"X\",\"\")","v":""},{"$f":"IF(ISNUMBER(SEARCH(\"Delphi-like approach to gauge stakeholders’ agreement with the TPP\",'Data extraction-synthesis'!L15)),\"X\",\"\")","v":""},{"$f":"IF(ISNUMBER(SEARCH(\"Data analysis\",'Data extraction-synthesis'!L15)),\"X\",\"\")","v":""},{"$f":"IF(ISNUMBER(SEARCH(\"Definition problem statement/use case  \",'Data extraction-synthesis'!L15)),\"X\",\"\")","v":""},{"$f":"IF(ISNUMBER(SEARCH(\"Identification of stakeholders to involve in draft TPP \",'Data extraction-synthesis'!L15)),\"X\",\"\")","v":""},{"$f":"IF(ISNUMBER(SEARCH(\"Definition TPP domains \",'Data extraction-synthesis'!L15)),\"X\",\"\")","v":""},{"$f":"IF(ISNUMBER(SEARCH(\"Survey to measure stakeholder’s preferences and agreement \",'Data extraction-synthesis'!L15)),\"X\",\"\")","v":""},{"$f":"IF(ISNUMBER(SEARCH(\"Reviewing available literature and data\",'Data extraction-synthesis'!L15)),\"X\",\"\")","v":"X"},{"$f":"IF(ISNUMBER(SEARCH(\"Defining scope TPP \",'Data extraction-synthesis'!L15)),\"X\",\"\")","v":""},{"$f":"IF(ISNUMBER(SEARCH(\"Interview with stakeholders\",'Data extraction-synthesis'!L15)),\"X\",\"\")","v":""},{"$f":"IF(ISNUMBER(SEARCH(\"Field research \",'Data extraction-synthesis'!L15)),\"X\",\"\")","v":""},{"$f":"IF(ISNUMBER(SEARCH(\"Consolidation of findings\",'Data extraction-synthesis'!L15)),\"X\",\"\")","v":""},{"$f":"IF(ISNUMBER(SEARCH(\"N/A\",'Data extraction-synthesis'!L15)),\"X\",\"\")","v":""}]
["Donadeu, M. F., A. S.: Olliaro, P. L.: Abela-Ridder, B","Target product profiles for the diagnosis of Taenia solium taeniasis, neurocysticercosis and porcine cysticercosis",{"$f":"IF(ISNUMBER(SEARCH(\"Consensus/public meeting\",'Data extraction-synthesis'!L16)),\"X\",\"\")","v":""},{"$f":"IF(ISNUMBER(SEARCH(\"Meeting with experts/stakeholders\",'Data extraction-synthesis'!L16)),\"X\",\"\")","v":"X"},{"$f":"IF(ISNUMBER(SEARCH(\"Feedback from the consultation (e.g. survey, meeting, expert opinion) is incorporated into the final TPPs\",'Data extraction-synthesis'!L16)),\"X\",\"\")","v":"X"},{"$f":"IF(ISNUMBER(SEARCH(\"Mapping\",'Data extraction-synthesis'!L16)),\"X\",\"\")","v":""},{"$f":"IF(ISNUMBER(SEARCH(\"Market analyses\",'Data extraction-synthesis'!L16)),\"X\",\"\")","v":""},{"$f":"IF(ISNUMBER(SEARCH(\"Literature search\",'Data extraction-synthesis'!L16)),\"X\",\"\")","v":""},{"$f":"IF(ISNUMBER(SEARCH(\"Survey to retrieve input relevant for TPP\",'Data extraction-synthesis'!L16)),\"X\",\"\")","v":""},{"$f":"IF(ISNUMBER(SEARCH(\"Landscaping exercise\",'Data extraction-synthesis'!L16)),\"X\",\"\")","v":""},{"$f":"IF(ISNUMBER(SEARCH(\"Draft TPP\",'Data extraction-synthesis'!L16)),\"X\",\"\")","v":"X"},{"$f":"IF(ISNUMBER(SEARCH(\"Round of revisions of TPP\",'Data extraction-synthesis'!L16)),\"X\",\"\")","v":"X"},{"$f":"IF(ISNUMBER(SEARCH(\"Draft shortened TPP\",'Data extraction-synthesis'!L16)),\"X\",\"\")","v":""},{"$f":"IF(ISNUMBER(SEARCH(\"Presentation of shortened TPP to large stakeholder audience\",'Data extraction-synthesis'!L16)),\"X\",\"\")","v":""},{"$f":"IF(ISNUMBER(SEARCH(\"Identification of most important needs\",'Data extraction-synthesis'!L16)),\"X\",\"\")","v":"X"},{"$f":"IF(ISNUMBER(SEARCH(\"Prioritization exercise\",'Data extraction-synthesis'!L16)),\"X\",\"\")","v":""},{"$f":"IF(ISNUMBER(SEARCH(\"Delphi-like approach to gauge stakeholders’ agreement with the TPP\",'Data extraction-synthesis'!L16)),\"X\",\"\")","v":""},{"$f":"IF(ISNUMBER(SEARCH(\"Data analysis\",'Data extraction-synthesis'!L16)),\"X\",\"\")","v":""},{"$f":"IF(ISNUMBER(SEARCH(\"Definition problem statement/use case  \",'Data extraction-synthesis'!L16)),\"X\",\"\")","v":""},{"$f":"IF(ISNUMBER(SEARCH(\"Identification of stakeholders to involve in draft TPP \",'Data extraction-synthesis'!L16)),\"X\",\"\")","v":""},{"$f":"IF(ISNUMBER(SEARCH(\"Definition TPP domains \",'Data extraction-synthesis'!L16)),\"X\",\"\")","v":""},{"$f":"IF(ISNUMBER(SEARCH(\"Survey to measure stakeholder’s preferences and agreement \",'Data extraction-synthesis'!L16)),\"X\",\"\")","v":"X"},{"$f":"IF(ISNUMBER(SEARCH(\"Reviewing available literature and data\",'Data extraction-synthesis'!L16)),\"X\",\"\")","v":""},{"$f":"IF(ISNUMBER(SEARCH(\"Defining scope TPP \",'Data extraction-synthesis'!L16)),\"X\",\"\")","v":""},{"$f":"IF(ISNUMBER(SEARCH(\"Interview with stakeholders\",'Data extraction-synthesis'!L16)),\"X\",\"\")","v":""},{"$f":"IF(ISNUMBER(SEARCH(\"Field research \",'Data extraction-synthesis'!L16)),\"X\",\"\")","v":""},{"$f":"IF(ISNUMBER(SEARCH(\"Consolidation of findings\",'Data extraction-synthesis'!L16)),\"X\",\"\")","v":""},{"$f":"IF(ISNUMBER(SEARCH(\"N/A\",'Data extraction-synthesis'!L16)),\"X\",\"\")","v":""}]
["FIND","Target Product Profile for Tests for Recent HIV Infection",{"$f":"IF(ISNUMBER(SEARCH(\"Consensus/public meeting\",'Data extraction-synthesis'!L17)),\"X\",\"\")","v":"X"},{"$f":"IF(ISNUMBER(SEARCH(\"Meeting with experts/stakeholders\",'Data extraction-synthesis'!L17)),\"X\",\"\")","v":""},{"$f":"IF(ISNUMBER(SEARCH(\"Feedback from the consultation (e.g. survey, meeting, expert opinion) is incorporated into the final TPPs\",'Data extraction-synthesis'!L17)),\"X\",\"\")","v":"X"},{"$f":"IF(ISNUMBER(SEARCH(\"Mapping\",'Data extraction-synthesis'!L17)),\"X\",\"\")","v":""},{"$f":"IF(ISNUMBER(SEARCH(\"Market analyses\",'Data extraction-synthesis'!L17)),\"X\",\"\")","v":""},{"$f":"IF(ISNUMBER(SEARCH(\"Literature search\",'Data extraction-synthesis'!L17)),\"X\",\"\")","v":""},{"$f":"IF(ISNUMBER(SEARCH(\"Survey to retrieve input relevant for TPP\",'Data extraction-synthesis'!L17)),\"X\",\"\")","v":""},{"$f":"IF(ISNUMBER(SEARCH(\"Landscaping exercise\",'Data extraction-synthesis'!L17)),\"X\",\"\")","v":""},{"$f":"IF(ISNUMBER(SEARCH(\"Draft TPP\",'Data extraction-synthesis'!L17)),\"X\",\"\")","v":"X"},{"$f":"IF(ISNUMBER(SEARCH(\"Round of revisions of TPP\",'Data extraction-synthesis'!L17)),\"X\",\"\")","v":""},{"$f":"IF(ISNUMBER(SEARCH(\"Draft shortened TPP\",'Data extraction-synthesis'!L17)),\"X\",\"\")","v":"X"},{"$f":"IF(ISNUMBER(SEARCH(\"Presentation of shortened TPP to large stakeholder audience\",'Data extraction-synthesis'!L17)),\"X\",\"\")","v":""},{"$f":"IF(ISNUMBER(SEARCH(\"Identification of most important needs\",'Data extraction-synthesis'!L17)),\"X\",\"\")","v":"X"},{"$f":"IF(ISNUMBER(SEARCH(\"Prioritization exercise\",'Data extraction-synthesis'!L17)),\"X\",\"\")","v":""},{"$f":"IF(ISNUMBER(SEARCH(\"Delphi-like approach to gauge stakeholders’ agreement with the TPP\",'Data extraction-synthesis'!L17)),\"X\",\"\")","v":"X"},{"$f":"IF(ISNUMBER(SEARCH(\"Data analysis\",'Data extraction-synthesis'!L17)),\"X\",\"\")","v":""},{"$f":"IF(ISNUMBER(SEARCH(\"Definition problem statement/use case  \",'Data extraction-synthesis'!L17)),\"X\",\"\")","v":"X"},{"$f":"IF(ISNUMBER(SEARCH(\"Identification of stakeholders to involve in draft TPP \",'Data extraction-synthesis'!L17)),\"X\",\"\")","v":""},{"$f":"IF(ISNUMBER(SEARCH(\"Definition TPP domains \",'Data extraction-synthesis'!L17)),\"X\",\"\")","v":""},{"$f":"IF(ISNUMBER(SEARCH(\"Survey to measure stakeholder’s preferences and agreement \",'Data extraction-synthesis'!L17)),\"X\",\"\")","v":""},{"$f":"IF(ISNUMBER(SEARCH(\"Reviewing available literature and data\",'Data extraction-synthesis'!L17)),\"X\",\"\")","v":""},{"$f":"IF(ISNUMBER(SEARCH(\"Defining scope TPP \",'Data extraction-synthesis'!L17)),\"X\",\"\")","v":""},{"$f":"IF(ISNUMBER(SEARCH(\"Interview with stakeholders\",'Data extraction-synthesis'!L17)),\"X\",\"\")","v":""},{"$f":"IF(ISNUMBER(SEARCH(\"Field research \",'Data extraction-synthesis'!L17)),\"X\",\"\")","v":""},{"$f":"IF(ISNUMBER(SEARCH(\"Consolidation of findings\",'Data extraction-synthesis'!L17)),\"X\",\"\")","v":"X"},{"$f":"IF(ISNUMBER(SEARCH(\"N/A\",'Data extraction-synthesis'!L17)),\"X\",\"\")","v":""}]
["FIND","Target Product Profile: Rapid test for diagnosis of malaria and screening for hyman African trypanosomiasis (HAT)",{"$f":"IF(ISNUMBER(SEARCH(\"Consensus/public meeting\",'Data extraction-synthesis'!L18)),\"X\",\"\")","v":""},{"$f":"IF(ISNUMBER(SEARCH(\"Meeting with experts/stakeholders\",'Data extraction-synthesis'!L18)),\"X\",\"\")","v":""},{"$f":"IF(ISNUMBER(SEARCH(\"Feedback from the consultation (e.g. survey, meeting, expert opinion) is incorporated into the final TPPs\",'Data extraction-synthesis'!L18)),\"X\",\"\")","v":""},{"$f":"IF(ISNUMBER(SEARCH(\"Mapping\",'Data extraction-synthesis'!L18)),\"X\",\"\")","v":""},{"$f":"IF(ISNUMBER(SEARCH(\"Market analyses\",'Data extraction-synthesis'!L18)),\"X\",\"\")","v":""},{"$f":"IF(ISNUMBER(SEARCH(\"Literature search\",'Data extraction-synthesis'!L18)),\"X\",\"\")","v":""},{"$f":"IF(ISNUMBER(SEARCH(\"Survey to retrieve input relevant for TPP\",'Data extraction-synthesis'!L18)),\"X\",\"\")","v":""},{"$f":"IF(ISNUMBER(SEARCH(\"Landscaping exercise\",'Data extraction-synthesis'!L18)),\"X\",\"\")","v":""},{"$f":"IF(ISNUMBER(SEARCH(\"Draft TPP\",'Data extraction-synthesis'!L18)),\"X\",\"\")","v":"X"},{"$f":"IF(ISNUMBER(SEARCH(\"Round of revisions of TPP\",'Data extraction-synthesis'!L18)),\"X\",\"\")","v":""},{"$f":"IF(ISNUMBER(SEARCH(\"Draft shortened TPP\",'Data extraction-synthesis'!L18)),\"X\",\"\")","v":""},{"$f":"IF(ISNUMBER(SEARCH(\"Presentation of shortened TPP to large stakeholder audience\",'Data extraction-synthesis'!L18)),\"X\",\"\")","v":""},{"$f":"IF(ISNUMBER(SEARCH(\"Identification of most important needs\",'Data extraction-synthesis'!L18)),\"X\",\"\")","v":""},{"$f":"IF(ISNUMBER(SEARCH(\"Prioritization exercise\",'Data extraction-synthesis'!L18)),\"X\",\"\")","v":""},{"$f":"IF(ISNUMBER(SEARCH(\"Delphi-like approach to gauge stakeholders’ agreement with the TPP\",'Data extraction-synthesis'!L18)),\"X\",\"\")","v":"X"},{"$f":"IF(ISNUMBER(SEARCH(\"Data analysis\",'Data extraction-synthesis'!L18)),\"X\",\"\")","v":""},{"$f":"IF(ISNUMBER(SEARCH(\"Definition problem statement/use case  \",'Data extraction-synthesis'!L18)),\"X\",\"\")","v":""},{"$f":"IF(ISNUMBER(SEARCH(\"Identification of stakeholders to involve in draft TPP \",'Data extraction-synthesis'!L18)),\"X\",\"\")","v":""},{"$f":"IF(ISNUMBER(SEARCH(\"Definition TPP domains \",'Data extraction-synthesis'!L18)),\"X\",\"\")","v":""},{"$f":"IF(ISNUMBER(SEARCH(\"Survey to measure stakeholder’s preferences and agreement \",'Data extraction-synthesis'!L18)),\"X\",\"\")","v":""},{"$f":"IF(ISNUMBER(SEARCH(\"Reviewing available literature and data\",'Data extraction-synthesis'!L18)),\"X\",\"\")","v":""},{"$f":"IF(ISNUMBER(SEARCH(\"Defining scope TPP \",'Data extraction-synthesis'!L18)),\"X\",\"\")","v":""},{"$f":"IF(ISNUMBER(SEARCH(\"Interview with stakeholders\",'Data extraction-synthesis'!L18)),\"X\",\"\")","v":""},{"$f":"IF(ISNUMBER(SEARCH(\"Field research \",'Data extraction-synthesis'!L18)),\"X\",\"\")","v":""},{"$f":"IF(ISNUMBER(SEARCH(\"Consolidation of findings\",'Data extraction-synthesis'!L18)),\"X\",\"\")","v":""},{"$f":"IF(ISNUMBER(SEARCH(\"N/A\",'Data extraction-synthesis'!L18)),\"X\",\"\")","v":""}]
["PATH","Target Product Profile: HIV Self-Test Version 4.1: A White Paper on the Evaluation of Current HIV Rapid Tests and Development of Core Specifications for Next-Generation HIV Tests",{"$f":"IF(ISNUMBER(SEARCH(\"Consensus/public meeting\",'Data extraction-synthesis'!L19)),\"X\",\"\")","v":""},{"$f":"IF(ISNUMBER(SEARCH(\"Meeting with experts/stakeholders\",'Data extraction-synthesis'!L19)),\"X\",\"\")","v":""},{"$f":"IF(ISNUMBER(SEARCH(\"Feedback from the consultation (e.g. survey, meeting, expert opinion) is incorporated into the final TPPs\",'Data extraction-synthesis'!L19)),\"X\",\"\")","v":""},{"$f":"IF(ISNUMBER(SEARCH(\"Mapping\",'Data extraction-synthesis'!L19)),\"X\",\"\")","v":""},{"$f":"IF(ISNUMBER(SEARCH(\"Market analyses\",'Data extraction-synthesis'!L19)),\"X\",\"\")","v":""},{"$f":"IF(ISNUMBER(SEARCH(\"Literature search\",'Data extraction-synthesis'!L19)),\"X\",\"\")","v":""},{"$f":"IF(ISNUMBER(SEARCH(\"Survey to retrieve input relevant for TPP\",'Data extraction-synthesis'!L19)),\"X\",\"\")","v":""},{"$f":"IF(ISNUMBER(SEARCH(\"Landscaping exercise\",'Data extraction-synthesis'!L19)),\"X\",\"\")","v":""},{"$f":"IF(ISNUMBER(SEARCH(\"Draft TPP\",'Data extraction-synthesis'!L19)),\"X\",\"\")","v":"X"},{"$f":"IF(ISNUMBER(SEARCH(\"Round of revisions of TPP\",'Data extraction-synthesis'!L19)),\"X\",\"\")","v":"X"},{"$f":"IF(ISNUMBER(SEARCH(\"Draft shortened TPP\",'Data extraction-synthesis'!L19)),\"X\",\"\")","v":""},{"$f":"IF(ISNUMBER(SEARCH(\"Presentation of shortened TPP to large stakeholder audience\",'Data extraction-synthesis'!L19)),\"X\",\"\")","v":""},{"$f":"IF(ISNUMBER(SEARCH(\"Identification of most important needs\",'Data extraction-synthesis'!L19)),\"X\",\"\")","v":""},{"$f":"IF(ISNUMBER(SEARCH(\"Prioritization exercise\",'Data extraction-synthesis'!L19)),\"X\",\"\")","v":""},{"$f":"IF(ISNUMBER(SEARCH(\"Delphi-like approach to gauge stakeholders’ agreement with the TPP\",'Data extraction-synthesis'!L19)),\"X\",\"\")","v":""},{"$f":"IF(ISNUMBER(SEARCH(\"Data analysis\",'Data extraction-synthesis'!L19)),\"X\",\"\")","v":""},{"$f":"IF(ISNUMBER(SEARCH(\"Definition problem statement/use case  \",'Data extraction-synthesis'!L19)),\"X\",\"\")","v":""},{"$f":"IF(ISNUMBER(SEARCH(\"Identification of stakeholders to involve in draft TPP \",'Data extraction-synthesis'!L19)),\"X\",\"\")","v":""},{"$f":"IF(ISNUMBER(SEARCH(\"Definition TPP domains \",'Data extraction-synthesis'!L19)),\"X\",\"\")","v":""},{"$f":"IF(ISNUMBER(SEARCH(\"Survey to measure stakeholder’s preferences and agreement \",'Data extraction-synthesis'!L19)),\"X\",\"\")","v":""},{"$f":"IF(ISNUMBER(SEARCH(\"Reviewing available literature and data\",'Data extraction-synthesis'!L19)),\"X\",\"\")","v":""},{"$f":"IF(ISNUMBER(SEARCH(\"Defining scope TPP \",'Data extraction-synthesis'!L19)),\"X\",\"\")","v":""},{"$f":"IF(ISNUMBER(SEARCH(\"Interview with stakeholders\",'Data extraction-synthesis'!L19)),\"X\",\"\")","v":""},{"$f":"IF(ISNUMBER(SEARCH(\"Field research \",'Data extraction-synthesis'!L19)),\"X\",\"\")","v":""},{"$f":"IF(ISNUMBER(SEARCH(\"Consolidation of findings\",'Data extraction-synthesis'!L19)),\"X\",\"\")","v":""},{"$f":"IF(ISNUMBER(SEARCH(\"N/A\",'Data extraction-synthesis'!L19)),\"X\",\"\")","v":""}]
["PATH","Diagnostics for neglected tropical diseases: Defining the best tools through target product profiles",{"$f":"IF(ISNUMBER(SEARCH(\"Consensus/public meeting\",'Data extraction-synthesis'!L20)),\"X\",\"\")","v":""},{"$f":"IF(ISNUMBER(SEARCH(\"Meeting with experts/stakeholders\",'Data extraction-synthesis'!L20)),\"X\",\"\")","v":""},{"$f":"IF(ISNUMBER(SEARCH(\"Feedback from the consultation (e.g. survey, meeting, expert opinion) is incorporated into the final TPPs\",'Data extraction-synthesis'!L20)),\"X\",\"\")","v":"X"},{"$f":"IF(ISNUMBER(SEARCH(\"Mapping\",'Data extraction-synthesis'!L20)),\"X\",\"\")","v":""},{"$f":"IF(ISNUMBER(SEARCH(\"Market analyses\",'Data extraction-synthesis'!L20)),\"X\",\"\")","v":""},{"$f":"IF(ISNUMBER(SEARCH(\"Literature search\",'Data extraction-synthesis'!L20)),\"X\",\"\")","v":""},{"$f":"IF(ISNUMBER(SEARCH(\"Survey to retrieve input relevant for TPP\",'Data extraction-synthesis'!L20)),\"X\",\"\")","v":""},{"$f":"IF(ISNUMBER(SEARCH(\"Landscaping exercise\",'Data extraction-synthesis'!L20)),\"X\",\"\")","v":""},{"$f":"IF(ISNUMBER(SEARCH(\"Draft TPP\",'Data extraction-synthesis'!L20)),\"X\",\"\")","v":"X"},{"$f":"IF(ISNUMBER(SEARCH(\"Round of revisions of TPP\",'Data extraction-synthesis'!L20)),\"X\",\"\")","v":"X"},{"$f":"IF(ISNUMBER(SEARCH(\"Draft shortened TPP\",'Data extraction-synthesis'!L20)),\"X\",\"\")","v":""},{"$f":"IF(ISNUMBER(SEARCH(\"Presentation of shortened TPP to large stakeholder audience\",'Data extraction-synthesis'!L20)),\"X\",\"\")","v":""},{"$f":"IF(ISNUMBER(SEARCH(\"Identification of most important needs\",'Data extraction-synthesis'!L20)),\"X\",\"\")","v":""},{"$f":"IF(ISNUMBER(SEARCH(\"Prioritization exercise\",'Data extraction-synthesis'!L20)),\"X\",\"\")","v":""},{"$f":"IF(ISNUMBER(SEARCH(\"Delphi-like approach to gauge stakeholders’ agreement with the TPP\",'Data extraction-synthesis'!L20)),\"X\",\"\")","v":""},{"$f":"IF(ISNUMBER(SEARCH(\"Data analysis\",'Data extraction-synthesis'!L20)),\"X\",\"\")","v":""},{"$f":"IF(ISNUMBER(SEARCH(\"Definition problem statement/use case  \",'Data extraction-synthesis'!L20)),\"X\",\"\")","v":"X"},{"$f":"IF(ISNUMBER(SEARCH(\"Identification of stakeholders to involve in draft TPP \",'Data extraction-synthesis'!L20)),\"X\",\"\")","v":""},{"$f":"IF(ISNUMBER(SEARCH(\"Definition TPP domains \",'Data extraction-synthesis'!L20)),\"X\",\"\")","v":""},{"$f":"IF(ISNUMBER(SEARCH(\"Survey to measure stakeholder’s preferences and agreement \",'Data extraction-synthesis'!L20)),\"X\",\"\")","v":""},{"$f":"IF(ISNUMBER(SEARCH(\"Reviewing available literature and data\",'Data extraction-synthesis'!L20)),\"X\",\"\")","v":"X"},{"$f":"IF(ISNUMBER(SEARCH(\"Defining scope TPP \",'Data extraction-synthesis'!L20)),\"X\",\"\")","v":""},{"$f":"IF(ISNUMBER(SEARCH(\"Interview with stakeholders\",'Data extraction-synthesis'!L20)),\"X\",\"\")","v":""},{"$f":"IF(ISNUMBER(SEARCH(\"Field research \",'Data extraction-synthesis'!L20)),\"X\",\"\")","v":""},{"$f":"IF(ISNUMBER(SEARCH(\"Consolidation of findings\",'Data extraction-synthesis'!L20)),\"X\",\"\")","v":""},{"$f":"IF(ISNUMBER(SEARCH(\"N/A\",'Data extraction-synthesis'!L20)),\"X\",\"\")","v":""}]
["PATH","Target Product Profile: Schistosomiasis Surveillance Diagnostic",{"$f":"IF(ISNUMBER(SEARCH(\"Consensus/public meeting\",'Data extraction-synthesis'!L21)),\"X\",\"\")","v":""},{"$f":"IF(ISNUMBER(SEARCH(\"Meeting with experts/stakeholders\",'Data extraction-synthesis'!L21)),\"X\",\"\")","v":""},{"$f":"IF(ISNUMBER(SEARCH(\"Feedback from the consultation (e.g. survey, meeting, expert opinion) is incorporated into the final TPPs\",'Data extraction-synthesis'!L21)),\"X\",\"\")","v":""},{"$f":"IF(ISNUMBER(SEARCH(\"Mapping\",'Data extraction-synthesis'!L21)),\"X\",\"\")","v":""},{"$f":"IF(ISNUMBER(SEARCH(\"Market analyses\",'Data extraction-synthesis'!L21)),\"X\",\"\")","v":""},{"$f":"IF(ISNUMBER(SEARCH(\"Literature search\",'Data extraction-synthesis'!L21)),\"X\",\"\")","v":""},{"$f":"IF(ISNUMBER(SEARCH(\"Survey to retrieve input relevant for TPP\",'Data extraction-synthesis'!L21)),\"X\",\"\")","v":""},{"$f":"IF(ISNUMBER(SEARCH(\"Landscaping exercise\",'Data extraction-synthesis'!L21)),\"X\",\"\")","v":""},{"$f":"IF(ISNUMBER(SEARCH(\"Draft TPP\",'Data extraction-synthesis'!L21)),\"X\",\"\")","v":""},{"$f":"IF(ISNUMBER(SEARCH(\"Round of revisions of TPP\",'Data extraction-synthesis'!L21)),\"X\",\"\")","v":""},{"$f":"IF(ISNUMBER(SEARCH(\"Draft shortened TPP\",'Data extraction-synthesis'!L21)),\"X\",\"\")","v":""},{"$f":"IF(ISNUMBER(SEARCH(\"Presentation of shortened TPP to large stakeholder audience\",'Data extraction-synthesis'!L21)),\"X\",\"\")","v":""},{"$f":"IF(ISNUMBER(SEARCH(\"Identification of most important needs\",'Data extraction-synthesis'!L21)),\"X\",\"\")","v":""},{"$f":"IF(ISNUMBER(SEARCH(\"Prioritization exercise\",'Data extraction-synthesis'!L21)),\"X\",\"\")","v":""},{"$f":"IF(ISNUMBER(SEARCH(\"Delphi-like approach to gauge stakeholders’ agreement with the TPP\",'Data extraction-synthesis'!L21)),\"X\",\"\")","v":""},{"$f":"IF(ISNUMBER(SEARCH(\"Data analysis\",'Data extraction-synthesis'!L21)),\"X\",\"\")","v":""},{"$f":"IF(ISNUMBER(SEARCH(\"Definition problem statement/use case  \",'Data extraction-synthesis'!L21)),\"X\",\"\")","v":""},{"$f":"IF(ISNUMBER(SEARCH(\"Identification of stakeholders to involve in draft TPP \",'Data extraction-synthesis'!L21)),\"X\",\"\")","v":""},{"$f":"IF(ISNUMBER(SEARCH(\"Definition TPP domains \",'Data extraction-synthesis'!L21)),\"X\",\"\")","v":""},{"$f":"IF(ISNUMBER(SEARCH(\"Survey to measure stakeholder’s preferences and agreement \",'Data extraction-synthesis'!L21)),\"X\",\"\")","v":""},{"$f":"IF(ISNUMBER(SEARCH(\"Reviewing available literature and data\",'Data extraction-synthesis'!L21)),\"X\",\"\")","v":""},{"$f":"IF(ISNUMBER(SEARCH(\"Defining scope TPP \",'Data extraction-synthesis'!L21)),\"X\",\"\")","v":""},{"$f":"IF(ISNUMBER(SEARCH(\"Interview with stakeholders\",'Data extraction-synthesis'!L21)),\"X\",\"\")","v":""},{"$f":"IF(ISNUMBER(SEARCH(\"Field research \",'Data extraction-synthesis'!L21)),\"X\",\"\")","v":""},{"$f":"IF(ISNUMBER(SEARCH(\"Consolidation of findings\",'Data extraction-synthesis'!L21)),\"X\",\"\")","v":""},{"$f":"IF(ISNUMBER(SEARCH(\"N/A\",'Data extraction-synthesis'!L21)),\"X\",\"\")","v":"X"}]
["UNICEF","UNICEF Target Product Profile Rapid E.coli Detection (version 2.0)",{"$f":"IF(ISNUMBER(SEARCH(\"Consensus/public meeting\",'Data extraction-synthesis'!#REF!)),\"X\",\"\")","v":""},{"$f":"IF(ISNUMBER(SEARCH(\"Meeting with experts/stakeholders\",'Data extraction-synthesis'!#REF!)),\"X\",\"\")","v":""},{"$f":"IF(ISNUMBER(SEARCH(\"Feedback from the consultation (e.g. survey, meeting, expert opinion) is incorporated into the final TPPs\",'Data extraction-synthesis'!#REF!)),\"X\",\"\")","v":""},{"$f":"IF(ISNUMBER(SEARCH(\"Mapping\",'Data extraction-synthesis'!#REF!)),\"X\",\"\")","v":""},{"$f":"IF(ISNUMBER(SEARCH(\"Market analyses\",'Data extraction-synthesis'!#REF!)),\"X\",\"\")","v":""},{"$f":"IF(ISNUMBER(SEARCH(\"Literature search\",'Data extraction-synthesis'!#REF!)),\"X\",\"\")","v":""},{"$f":"IF(ISNUMBER(SEARCH(\"Survey to retrieve input relevant for TPP\",'Data extraction-synthesis'!#REF!)),\"X\",\"\")","v":""},{"$f":"IF(ISNUMBER(SEARCH(\"Landscaping exercise\",'Data extraction-synthesis'!#REF!)),\"X\",\"\")","v":""},{"$f":"IF(ISNUMBER(SEARCH(\"Draft TPP\",'Data extraction-synthesis'!#REF!)),\"X\",\"\")","v":""},{"$f":"IF(ISNUMBER(SEARCH(\"Round of revisions of TPP\",'Data extraction-synthesis'!#REF!)),\"X\",\"\")","v":""},{"$f":"IF(ISNUMBER(SEARCH(\"Draft shortened TPP\",'Data extraction-synthesis'!#REF!)),\"X\",\"\")","v":""},{"$f":"IF(ISNUMBER(SEARCH(\"Presentation of shortened TPP to large stakeholder audience\",'Data extraction-synthesis'!#REF!)),\"X\",\"\")","v":""},{"$f":"IF(ISNUMBER(SEARCH(\"Identification of most important needs\",'Data extraction-synthesis'!#REF!)),\"X\",\"\")","v":""},{"$f":"IF(ISNUMBER(SEARCH(\"Prioritization exercise\",'Data extraction-synthesis'!#REF!)),\"X\",\"\")","v":""},{"$f":"IF(ISNUMBER(SEARCH(\"Delphi-like approach to gauge stakeholders’ agreement with the TPP\",'Data extraction-synthesis'!#REF!)),\"X\",\"\")","v":""},{"$f":"IF(ISNUMBER(SEARCH(\"Data analysis\",'Data extraction-synthesis'!#REF!)),\"X\",\"\")","v":""},{"$f":"IF(ISNUMBER(SEARCH(\"Definition problem statement/use case  \",'Data extraction-synthesis'!#REF!)),\"X\",\"\")","v":""},{"$f":"IF(ISNUMBER(SEARCH(\"Identification of stakeholders to involve in draft TPP \",'Data extraction-synthesis'!#REF!)),\"X\",\"\")","v":""},{"$f":"IF(ISNUMBER(SEARCH(\"Definition TPP domains \",'Data extraction-synthesis'!#REF!)),\"X\",\"\")","v":""},{"$f":"IF(ISNUMBER(SEARCH(\"Survey to measure stakeholder’s preferences and agreement \",'Data extraction-synthesis'!#REF!)),\"X\",\"\")","v":""},{"$f":"IF(ISNUMBER(SEARCH(\"Reviewing available literature and data\",'Data extraction-synthesis'!#REF!)),\"X\",\"\")","v":""},{"$f":"IF(ISNUMBER(SEARCH(\"Defining scope TPP \",'Data extraction-synthesis'!#REF!)),\"X\",\"\")","v":""},{"$f":"IF(ISNUMBER(SEARCH(\"Interview with stakeholders\",'Data extraction-synthesis'!#REF!)),\"X\",\"\")","v":""},{"$f":"IF(ISNUMBER(SEARCH(\"Field research \",'Data extraction-synthesis'!#REF!)),\"X\",\"\")","v":""},{"$f":"IF(ISNUMBER(SEARCH(\"Consolidation of findings\",'Data extraction-synthesis'!#REF!)),\"X\",\"\")","v":""},{"$f":"IF(ISNUMBER(SEARCH(\"N/A\",'Data extraction-synthesis'!#REF!)),\"X\",\"\")","v":""}]
["UNICEF","UNICEF Target Product Profile Rapid E.coli Detection (1.4)",{"$f":"IF(ISNUMBER(SEARCH(\"Consensus/public meeting\",'Data extraction-synthesis'!L22)),\"X\",\"\")","v":""},{"$f":"IF(ISNUMBER(SEARCH(\"Meeting with experts/stakeholders\",'Data extraction-synthesis'!L22)),\"X\",\"\")","v":""},{"$f":"IF(ISNUMBER(SEARCH(\"Feedback from the consultation (e.g. survey, meeting, expert opinion) is incorporated into the final TPPs\",'Data extraction-synthesis'!L22)),\"X\",\"\")","v":""},{"$f":"IF(ISNUMBER(SEARCH(\"Mapping\",'Data extraction-synthesis'!L22)),\"X\",\"\")","v":""},{"$f":"IF(ISNUMBER(SEARCH(\"Market analyses\",'Data extraction-synthesis'!L22)),\"X\",\"\")","v":""},{"$f":"IF(ISNUMBER(SEARCH(\"Literature search\",'Data extraction-synthesis'!L22)),\"X\",\"\")","v":""},{"$f":"IF(ISNUMBER(SEARCH(\"Survey to retrieve input relevant for TPP\",'Data extraction-synthesis'!L22)),\"X\",\"\")","v":""},{"$f":"IF(ISNUMBER(SEARCH(\"Landscaping exercise\",'Data extraction-synthesis'!L22)),\"X\",\"\")","v":""},{"$f":"IF(ISNUMBER(SEARCH(\"Draft TPP\",'Data extraction-synthesis'!L22)),\"X\",\"\")","v":""},{"$f":"IF(ISNUMBER(SEARCH(\"Round of revisions of TPP\",'Data extraction-synthesis'!L22)),\"X\",\"\")","v":""},{"$f":"IF(ISNUMBER(SEARCH(\"Draft shortened TPP\",'Data extraction-synthesis'!L22)),\"X\",\"\")","v":""},{"$f":"IF(ISNUMBER(SEARCH(\"Presentation of shortened TPP to large stakeholder audience\",'Data extraction-synthesis'!L22)),\"X\",\"\")","v":""},{"$f":"IF(ISNUMBER(SEARCH(\"Identification of most important needs\",'Data extraction-synthesis'!L22)),\"X\",\"\")","v":""},{"$f":"IF(ISNUMBER(SEARCH(\"Prioritization exercise\",'Data extraction-synthesis'!L22)),\"X\",\"\")","v":""},{"$f":"IF(ISNUMBER(SEARCH(\"Delphi-like approach to gauge stakeholders’ agreement with the TPP\",'Data extraction-synthesis'!L22)),\"X\",\"\")","v":""},{"$f":"IF(ISNUMBER(SEARCH(\"Data analysis\",'Data extraction-synthesis'!L22)),\"X\",\"\")","v":""},{"$f":"IF(ISNUMBER(SEARCH(\"Definition problem statement/use case  \",'Data extraction-synthesis'!L22)),\"X\",\"\")","v":""},{"$f":"IF(ISNUMBER(SEARCH(\"Identification of stakeholders to involve in draft TPP \",'Data extraction-synthesis'!L22)),\"X\",\"\")","v":""},{"$f":"IF(ISNUMBER(SEARCH(\"Definition TPP domains \",'Data extraction-synthesis'!L22)),\"X\",\"\")","v":""},{"$f":"IF(ISNUMBER(SEARCH(\"Survey to measure stakeholder’s preferences and agreement \",'Data extraction-synthesis'!L22)),\"X\",\"\")","v":""},{"$f":"IF(ISNUMBER(SEARCH(\"Reviewing available literature and data\",'Data extraction-synthesis'!L22)),\"X\",\"\")","v":""},{"$f":"IF(ISNUMBER(SEARCH(\"Defining scope TPP \",'Data extraction-synthesis'!L22)),\"X\",\"\")","v":""},{"$f":"IF(ISNUMBER(SEARCH(\"Interview with stakeholders\",'Data extraction-synthesis'!L22)),\"X\",\"\")","v":""},{"$f":"IF(ISNUMBER(SEARCH(\"Field research \",'Data extraction-synthesis'!L22)),\"X\",\"\")","v":""},{"$f":"IF(ISNUMBER(SEARCH(\"Consolidation of findings\",'Data extraction-synthesis'!L22)),\"X\",\"\")","v":""},{"$f":"IF(ISNUMBER(SEARCH(\"N/A\",'Data extraction-synthesis'!L22)),\"X\",\"\")","v":"X"}]
["WHO","High-priority target product profile for new tubercolosis diagnostics: report of a consensus meeting",{"$f":"IF(ISNUMBER(SEARCH(\"Consensus/public meeting\",'Data extraction-synthesis'!L24)),\"X\",\"\")","v":"X"},{"$f":"IF(ISNUMBER(SEARCH(\"Meeting with experts/stakeholders\",'Data extraction-synthesis'!L24)),\"X\",\"\")","v":""},{"$f":"IF(ISNUMBER(SEARCH(\"Feedback from the consultation (e.g. survey, meeting, expert opinion) is incorporated into the final TPPs\",'Data extraction-synthesis'!L24)),\"X\",\"\")","v":""},{"$f":"IF(ISNUMBER(SEARCH(\"Mapping\",'Data extraction-synthesis'!L24)),\"X\",\"\")","v":""},{"$f":"IF(ISNUMBER(SEARCH(\"Market analyses\",'Data extraction-synthesis'!L24)),\"X\",\"\")","v":""},{"$f":"IF(ISNUMBER(SEARCH(\"Literature search\",'Data extraction-synthesis'!L24)),\"X\",\"\")","v":""},{"$f":"IF(ISNUMBER(SEARCH(\"Survey to retrieve input relevant for TPP\",'Data extraction-synthesis'!L24)),\"X\",\"\")","v":""},{"$f":"IF(ISNUMBER(SEARCH(\"Landscaping exercise\",'Data extraction-synthesis'!L24)),\"X\",\"\")","v":""},{"$f":"IF(ISNUMBER(SEARCH(\"Draft TPP\",'Data extraction-synthesis'!L24)),\"X\",\"\")","v":"X"},{"$f":"IF(ISNUMBER(SEARCH(\"Round of revisions of TPP\",'Data extraction-synthesis'!L24)),\"X\",\"\")","v":""},{"$f":"IF(ISNUMBER(SEARCH(\"Draft shortened TPP\",'Data extraction-synthesis'!L24)),\"X\",\"\")","v":"X"},{"$f":"IF(ISNUMBER(SEARCH(\"Presentation of shortened TPP to large stakeholder audience\",'Data extraction-synthesis'!L24)),\"X\",\"\")","v":""},{"$f":"IF(ISNUMBER(SEARCH(\"Identification of most important needs\",'Data extraction-synthesis'!L24)),\"X\",\"\")","v":""},{"$f":"IF(ISNUMBER(SEARCH(\"Prioritization exercise\",'Data extraction-synthesis'!L24)),\"X\",\"\")","v":"X"},{"$f":"IF(ISNUMBER(SEARCH(\"Delphi-like approach to gauge stakeholders’ agreement with the TPP\",'Data extraction-synthesis'!L24)),\"X\",\"\")","v":"X"},{"$f":"IF(ISNUMBER(SEARCH(\"Data analysis\",'Data extraction-synthesis'!L24)),\"X\",\"\")","v":""},{"$f":"IF(ISNUMBER(SEARCH(\"Definition problem statement/use case  \",'Data extraction-synthesis'!L24)),\"X\",\"\")","v":""},{"$f":"IF(ISNUMBER(SEARCH(\"Identification of stakeholders to involve in draft TPP \",'Data extraction-synthesis'!L24)),\"X\",\"\")","v":""},{"$f":"IF(ISNUMBER(SEARCH(\"Definition TPP domains \",'Data extraction-synthesis'!L24)),\"X\",\"\")","v":""},{"$f":"IF(ISNUMBER(SEARCH(\"Survey to measure stakeholder’s preferences and agreement \",'Data extraction-synthesis'!L24)),\"X\",\"\")","v":""},{"$f":"IF(ISNUMBER(SEARCH(\"Reviewing available literature and data\",'Data extraction-synthesis'!L24)),\"X\",\"\")","v":""},{"$f":"IF(ISNUMBER(SEARCH(\"Defining scope TPP \",'Data extraction-synthesis'!L24)),\"X\",\"\")","v":""},{"$f":"IF(ISNUMBER(SEARCH(\"Interview with stakeholders\",'Data extraction-synthesis'!L24)),\"X\",\"\")","v":""},{"$f":"IF(ISNUMBER(SEARCH(\"Field research \",'Data extraction-synthesis'!L24)),\"X\",\"\")","v":""},{"$f":"IF(ISNUMBER(SEARCH(\"Consolidation of findings\",'Data extraction-synthesis'!L24)),\"X\",\"\")","v":""},{"$f":"IF(ISNUMBER(SEARCH(\"N/A\",'Data extraction-synthesis'!L24)),\"X\",\"\")","v":""}]
["WHO","Development of a Target Product Profile (TPP) and framework for evaluation for a test predicting progression from tubercolosis infection to active disease",{"$f":"IF(ISNUMBER(SEARCH(\"Consensus/public meeting\",'Data extraction-synthesis'!L25)),\"X\",\"\")","v":"X"},{"$f":"IF(ISNUMBER(SEARCH(\"Meeting with experts/stakeholders\",'Data extraction-synthesis'!L25)),\"X\",\"\")","v":"X"},{"$f":"IF(ISNUMBER(SEARCH(\"Feedback from the consultation (e.g. survey, meeting, expert opinion) is incorporated into the final TPPs\",'Data extraction-synthesis'!L25)),\"X\",\"\")","v":""},{"$f":"IF(ISNUMBER(SEARCH(\"Mapping\",'Data extraction-synthesis'!L25)),\"X\",\"\")","v":""},{"$f":"IF(ISNUMBER(SEARCH(\"Market analyses\",'Data extraction-synthesis'!L25)),\"X\",\"\")","v":""},{"$f":"IF(ISNUMBER(SEARCH(\"Literature search\",'Data extraction-synthesis'!L25)),\"X\",\"\")","v":""},{"$f":"IF(ISNUMBER(SEARCH(\"Survey to retrieve input relevant for TPP\",'Data extraction-synthesis'!L25)),\"X\",\"\")","v":"X"},{"$f":"IF(ISNUMBER(SEARCH(\"Landscaping exercise\",'Data extraction-synthesis'!L25)),\"X\",\"\")","v":""},{"$f":"IF(ISNUMBER(SEARCH(\"Draft TPP\",'Data extraction-synthesis'!L25)),\"X\",\"\")","v":"X"},{"$f":"IF(ISNUMBER(SEARCH(\"Round of revisions of TPP\",'Data extraction-synthesis'!L25)),\"X\",\"\")","v":""},{"$f":"IF(ISNUMBER(SEARCH(\"Draft shortened TPP\",'Data extraction-synthesis'!L25)),\"X\",\"\")","v":""},{"$f":"IF(ISNUMBER(SEARCH(\"Presentation of shortened TPP to large stakeholder audience\",'Data extraction-synthesis'!L25)),\"X\",\"\")","v":""},{"$f":"IF(ISNUMBER(SEARCH(\"Identification of most important needs\",'Data extraction-synthesis'!L25)),\"X\",\"\")","v":""},{"$f":"IF(ISNUMBER(SEARCH(\"Prioritization exercise\",'Data extraction-synthesis'!L25)),\"X\",\"\")","v":""},{"$f":"IF(ISNUMBER(SEARCH(\"Delphi-like approach to gauge stakeholders’ agreement with the TPP\",'Data extraction-synthesis'!L25)),\"X\",\"\")","v":"X"},{"$f":"IF(ISNUMBER(SEARCH(\"Data analysis\",'Data extraction-synthesis'!L25)),\"X\",\"\")","v":""},{"$f":"IF(ISNUMBER(SEARCH(\"Definition problem statement/use case  \",'Data extraction-synthesis'!L25)),\"X\",\"\")","v":""},{"$f":"IF(ISNUMBER(SEARCH(\"Identification of stakeholders to involve in draft TPP \",'Data extraction-synthesis'!L25)),\"X\",\"\")","v":""},{"$f":"IF(ISNUMBER(SEARCH(\"Definition TPP domains \",'Data extraction-synthesis'!L25)),\"X\",\"\")","v":""},{"$f":"IF(ISNUMBER(SEARCH(\"Survey to measure stakeholder’s preferences and agreement \",'Data extraction-synthesis'!L25)),\"X\",\"\")","v":""},{"$f":"IF(ISNUMBER(SEARCH(\"Reviewing available literature and data\",'Data extraction-synthesis'!L25)),\"X\",\"\")","v":""},{"$f":"IF(ISNUMBER(SEARCH(\"Defining scope TPP \",'Data extraction-synthesis'!L25)),\"X\",\"\")","v":""},{"$f":"IF(ISNUMBER(SEARCH(\"Interview with stakeholders\",'Data extraction-synthesis'!L25)),\"X\",\"\")","v":""},{"$f":"IF(ISNUMBER(SEARCH(\"Field research \",'Data extraction-synthesis'!L25)),\"X\",\"\")","v":""},{"$f":"IF(ISNUMBER(SEARCH(\"Consolidation of findings\",'Data extraction-synthesis'!L25)),\"X\",\"\")","v":""},{"$f":"IF(ISNUMBER(SEARCH(\"N/A\",'Data extraction-synthesis'!L25)),\"X\",\"\")","v":""}]
["WHO","Specifications for a rapid diagnostic test for meningitis African meningitis belt/ Target product profile for the development of a new generation of rapid test for the diagnosis of bacterial meningitis",{"$f":"IF(ISNUMBER(SEARCH(\"Consensus/public meeting\",'Data extraction-synthesis'!L26)),\"X\",\"\")","v":""},{"$f":"IF(ISNUMBER(SEARCH(\"Meeting with experts/stakeholders\",'Data extraction-synthesis'!L26)),\"X\",\"\")","v":""},{"$f":"IF(ISNUMBER(SEARCH(\"Feedback from the consultation (e.g. survey, meeting, expert opinion) is incorporated into the final TPPs\",'Data extraction-synthesis'!L26)),\"X\",\"\")","v":""},{"$f":"IF(ISNUMBER(SEARCH(\"Mapping\",'Data extraction-synthesis'!L26)),\"X\",\"\")","v":""},{"$f":"IF(ISNUMBER(SEARCH(\"Market analyses\",'Data extraction-synthesis'!L26)),\"X\",\"\")","v":""},{"$f":"IF(ISNUMBER(SEARCH(\"Literature search\",'Data extraction-synthesis'!L26)),\"X\",\"\")","v":""},{"$f":"IF(ISNUMBER(SEARCH(\"Survey to retrieve input relevant for TPP\",'Data extraction-synthesis'!L26)),\"X\",\"\")","v":""},{"$f":"IF(ISNUMBER(SEARCH(\"Landscaping exercise\",'Data extraction-synthesis'!L26)),\"X\",\"\")","v":""},{"$f":"IF(ISNUMBER(SEARCH(\"Draft TPP\",'Data extraction-synthesis'!L26)),\"X\",\"\")","v":""},{"$f":"IF(ISNUMBER(SEARCH(\"Round of revisions of TPP\",'Data extraction-synthesis'!L26)),\"X\",\"\")","v":""},{"$f":"IF(ISNUMBER(SEARCH(\"Draft shortened TPP\",'Data extraction-synthesis'!L26)),\"X\",\"\")","v":""},{"$f":"IF(ISNUMBER(SEARCH(\"Presentation of shortened TPP to large stakeholder audience\",'Data extraction-synthesis'!L26)),\"X\",\"\")","v":""},{"$f":"IF(ISNUMBER(SEARCH(\"Identification of most important needs\",'Data extraction-synthesis'!L26)),\"X\",\"\")","v":""},{"$f":"IF(ISNUMBER(SEARCH(\"Prioritization exercise\",'Data extraction-synthesis'!L26)),\"X\",\"\")","v":""},{"$f":"IF(ISNUMBER(SEARCH(\"Delphi-like approach to gauge stakeholders’ agreement with the TPP\",'Data extraction-synthesis'!L26)),\"X\",\"\")","v":""},{"$f":"IF(ISNUMBER(SEARCH(\"Data analysis\",'Data extraction-synthesis'!L26)),\"X\",\"\")","v":""},{"$f":"IF(ISNUMBER(SEARCH(\"Definition problem statement/use case  \",'Data extraction-synthesis'!L26)),\"X\",\"\")","v":""},{"$f":"IF(ISNUMBER(SEARCH(\"Identification of stakeholders to involve in draft TPP \",'Data extraction-synthesis'!L26)),\"X\",\"\")","v":""},{"$f":"IF(ISNUMBER(SEARCH(\"Definition TPP domains \",'Data extraction-synthesis'!L26)),\"X\",\"\")","v":""},{"$f":"IF(ISNUMBER(SEARCH(\"Survey to measure stakeholder’s preferences and agreement \",'Data extraction-synthesis'!L26)),\"X\",\"\")","v":""},{"$f":"IF(ISNUMBER(SEARCH(\"Reviewing available literature and data\",'Data extraction-synthesis'!L26)),\"X\",\"\")","v":""},{"$f":"IF(ISNUMBER(SEARCH(\"Defining scope TPP \",'Data extraction-synthesis'!L26)),\"X\",\"\")","v":""},{"$f":"IF(ISNUMBER(SEARCH(\"Interview with stakeholders\",'Data extraction-synthesis'!L26)),\"X\",\"\")","v":""},{"$f":"IF(ISNUMBER(SEARCH(\"Field research \",'Data extraction-synthesis'!L26)),\"X\",\"\")","v":""},{"$f":"IF(ISNUMBER(SEARCH(\"Consolidation of findings\",'Data extraction-synthesis'!L26)),\"X\",\"\")","v":""},{"$f":"IF(ISNUMBER(SEARCH(\"N/A\",'Data extraction-synthesis'!L26)),\"X\",\"\")","v":"X"}]
["WHO","Target Product Profile for Zaire ebolavirus rapid,simple test to be used in the control of the Ebola outbreak in West Africa",{"$f":"IF(ISNUMBER(SEARCH(\"Consensus/public meeting\",'Data extraction-synthesis'!L27)),\"X\",\"\")","v":""},{"$f":"IF(ISNUMBER(SEARCH(\"Meeting with experts/stakeholders\",'Data extraction-synthesis'!L27)),\"X\",\"\")","v":""},{"$f":"IF(ISNUMBER(SEARCH(\"Feedback from the consultation (e.g. survey, meeting, expert opinion) is incorporated into the final TPPs\",'Data extraction-synthesis'!L27)),\"X\",\"\")","v":""},{"$f":"IF(ISNUMBER(SEARCH(\"Mapping\",'Data extraction-synthesis'!L27)),\"X\",\"\")","v":""},{"$f":"IF(ISNUMBER(SEARCH(\"Market analyses\",'Data extraction-synthesis'!L27)),\"X\",\"\")","v":""},{"$f":"IF(ISNUMBER(SEARCH(\"Literature search\",'Data extraction-synthesis'!L27)),\"X\",\"\")","v":""},{"$f":"IF(ISNUMBER(SEARCH(\"Survey to retrieve input relevant for TPP\",'Data extraction-synthesis'!L27)),\"X\",\"\")","v":""},{"$f":"IF(ISNUMBER(SEARCH(\"Landscaping exercise\",'Data extraction-synthesis'!L27)),\"X\",\"\")","v":""},{"$f":"IF(ISNUMBER(SEARCH(\"Draft TPP\",'Data extraction-synthesis'!L27)),\"X\",\"\")","v":""},{"$f":"IF(ISNUMBER(SEARCH(\"Round of revisions of TPP\",'Data extraction-synthesis'!L27)),\"X\",\"\")","v":""},{"$f":"IF(ISNUMBER(SEARCH(\"Draft shortened TPP\",'Data extraction-synthesis'!L27)),\"X\",\"\")","v":""},{"$f":"IF(ISNUMBER(SEARCH(\"Presentation of shortened TPP to large stakeholder audience\",'Data extraction-synthesis'!L27)),\"X\",\"\")","v":""},{"$f":"IF(ISNUMBER(SEARCH(\"Identification of most important needs\",'Data extraction-synthesis'!L27)),\"X\",\"\")","v":""},{"$f":"IF(ISNUMBER(SEARCH(\"Prioritization exercise\",'Data extraction-synthesis'!L27)),\"X\",\"\")","v":""},{"$f":"IF(ISNUMBER(SEARCH(\"Delphi-like approach to gauge stakeholders’ agreement with the TPP\",'Data extraction-synthesis'!L27)),\"X\",\"\")","v":""},{"$f":"IF(ISNUMBER(SEARCH(\"Data analysis\",'Data extraction-synthesis'!L27)),\"X\",\"\")","v":""},{"$f":"IF(ISNUMBER(SEARCH(\"Definition problem statement/use case  \",'Data extraction-synthesis'!L27)),\"X\",\"\")","v":""},{"$f":"IF(ISNUMBER(SEARCH(\"Identification of stakeholders to involve in draft TPP \",'Data extraction-synthesis'!L27)),\"X\",\"\")","v":""},{"$f":"IF(ISNUMBER(SEARCH(\"Definition TPP domains \",'Data extraction-synthesis'!L27)),\"X\",\"\")","v":""},{"$f":"IF(ISNUMBER(SEARCH(\"Survey to measure stakeholder’s preferences and agreement \",'Data extraction-synthesis'!L27)),\"X\",\"\")","v":""},{"$f":"IF(ISNUMBER(SEARCH(\"Reviewing available literature and data\",'Data extraction-synthesis'!L27)),\"X\",\"\")","v":""},{"$f":"IF(ISNUMBER(SEARCH(\"Defining scope TPP \",'Data extraction-synthesis'!L27)),\"X\",\"\")","v":""},{"$f":"IF(ISNUMBER(SEARCH(\"Interview with stakeholders\",'Data extraction-synthesis'!L27)),\"X\",\"\")","v":""},{"$f":"IF(ISNUMBER(SEARCH(\"Field research \",'Data extraction-synthesis'!L27)),\"X\",\"\")","v":""},{"$f":"IF(ISNUMBER(SEARCH(\"Consolidation of findings\",'Data extraction-synthesis'!L27)),\"X\",\"\")","v":""},{"$f":"IF(ISNUMBER(SEARCH(\"N/A\",'Data extraction-synthesis'!L27)),\"X\",\"\")","v":"X"}]
["WHO","Report of WHO-FIND meeting on diagnostics for Buruli ulcer",{"$f":"IF(ISNUMBER(SEARCH(\"Consensus/public meeting\",'Data extraction-synthesis'!L28)),\"X\",\"\")","v":""},{"$f":"IF(ISNUMBER(SEARCH(\"Meeting with experts/stakeholders\",'Data extraction-synthesis'!L28)),\"X\",\"\")","v":""},{"$f":"IF(ISNUMBER(SEARCH(\"Feedback from the consultation (e.g. survey, meeting, expert opinion) is incorporated into the final TPPs\",'Data extraction-synthesis'!L28)),\"X\",\"\")","v":""},{"$f":"IF(ISNUMBER(SEARCH(\"Mapping\",'Data extraction-synthesis'!L28)),\"X\",\"\")","v":""},{"$f":"IF(ISNUMBER(SEARCH(\"Market analyses\",'Data extraction-synthesis'!L28)),\"X\",\"\")","v":""},{"$f":"IF(ISNUMBER(SEARCH(\"Literature search\",'Data extraction-synthesis'!L28)),\"X\",\"\")","v":""},{"$f":"IF(ISNUMBER(SEARCH(\"Survey to retrieve input relevant for TPP\",'Data extraction-synthesis'!L28)),\"X\",\"\")","v":""},{"$f":"IF(ISNUMBER(SEARCH(\"Landscaping exercise\",'Data extraction-synthesis'!L28)),\"X\",\"\")","v":""},{"$f":"IF(ISNUMBER(SEARCH(\"Draft TPP\",'Data extraction-synthesis'!L28)),\"X\",\"\")","v":"X"},{"$f":"IF(ISNUMBER(SEARCH(\"Round of revisions of TPP\",'Data extraction-synthesis'!L28)),\"X\",\"\")","v":""},{"$f":"IF(ISNUMBER(SEARCH(\"Draft shortened TPP\",'Data extraction-synthesis'!L28)),\"X\",\"\")","v":""},{"$f":"IF(ISNUMBER(SEARCH(\"Presentation of shortened TPP to large stakeholder audience\",'Data extraction-synthesis'!L28)),\"X\",\"\")","v":""},{"$f":"IF(ISNUMBER(SEARCH(\"Identification of most important needs\",'Data extraction-synthesis'!L28)),\"X\",\"\")","v":""},{"$f":"IF(ISNUMBER(SEARCH(\"Prioritization exercise\",'Data extraction-synthesis'!L28)),\"X\",\"\")","v":""},{"$f":"IF(ISNUMBER(SEARCH(\"Delphi-like approach to gauge stakeholders’ agreement with the TPP\",'Data extraction-synthesis'!L28)),\"X\",\"\")","v":""},{"$f":"IF(ISNUMBER(SEARCH(\"Data analysis\",'Data extraction-synthesis'!L28)),\"X\",\"\")","v":""},{"$f":"IF(ISNUMBER(SEARCH(\"Definition problem statement/use case  \",'Data extraction-synthesis'!L28)),\"X\",\"\")","v":"X"},{"$f":"IF(ISNUMBER(SEARCH(\"Identification of stakeholders to involve in draft TPP \",'Data extraction-synthesis'!L28)),\"X\",\"\")","v":""},{"$f":"IF(ISNUMBER(SEARCH(\"Definition TPP domains \",'Data extraction-synthesis'!L28)),\"X\",\"\")","v":""},{"$f":"IF(ISNUMBER(SEARCH(\"Survey to measure stakeholder’s preferences and agreement \",'Data extraction-synthesis'!L28)),\"X\",\"\")","v":""},{"$f":"IF(ISNUMBER(SEARCH(\"Reviewing available literature and data\",'Data extraction-synthesis'!L28)),\"X\",\"\")","v":""},{"$f":"IF(ISNUMBER(SEARCH(\"Defining scope TPP \",'Data extraction-synthesis'!L28)),\"X\",\"\")","v":""},{"$f":"IF(ISNUMBER(SEARCH(\"Interview with stakeholders\",'Data extraction-synthesis'!L28)),\"X\",\"\")","v":""},{"$f":"IF(ISNUMBER(SEARCH(\"Field research \",'Data extraction-synthesis'!L28)),\"X\",\"\")","v":""},{"$f":"IF(ISNUMBER(SEARCH(\"Consolidation of findings\",'Data extraction-synthesis'!L28)),\"X\",\"\")","v":""},{"$f":"IF(ISNUMBER(SEARCH(\"N/A\",'Data extraction-synthesis'!L28)),\"X\",\"\")","v":""}]
["WHO","Taenia solium taeniasis/cysticercosis diagnostic tools. Report of a stakeholder meeting",{"$f":"IF(ISNUMBER(SEARCH(\"Consensus/public meeting\",'Data extraction-synthesis'!L29)),\"X\",\"\")","v":""},{"$f":"IF(ISNUMBER(SEARCH(\"Meeting with experts/stakeholders\",'Data extraction-synthesis'!L29)),\"X\",\"\")","v":""},{"$f":"IF(ISNUMBER(SEARCH(\"Feedback from the consultation (e.g. survey, meeting, expert opinion) is incorporated into the final TPPs\",'Data extraction-synthesis'!L29)),\"X\",\"\")","v":""},{"$f":"IF(ISNUMBER(SEARCH(\"Mapping\",'Data extraction-synthesis'!L29)),\"X\",\"\")","v":""},{"$f":"IF(ISNUMBER(SEARCH(\"Market analyses\",'Data extraction-synthesis'!L29)),\"X\",\"\")","v":""},{"$f":"IF(ISNUMBER(SEARCH(\"Literature search\",'Data extraction-synthesis'!L29)),\"X\",\"\")","v":""},{"$f":"IF(ISNUMBER(SEARCH(\"Survey to retrieve input relevant for TPP\",'Data extraction-synthesis'!L29)),\"X\",\"\")","v":""},{"$f":"IF(ISNUMBER(SEARCH(\"Landscaping exercise\",'Data extraction-synthesis'!L29)),\"X\",\"\")","v":""},{"$f":"IF(ISNUMBER(SEARCH(\"Draft TPP\",'Data extraction-synthesis'!L29)),\"X\",\"\")","v":"X"},{"$f":"IF(ISNUMBER(SEARCH(\"Round of revisions of TPP\",'Data extraction-synthesis'!L29)),\"X\",\"\")","v":""},{"$f":"IF(ISNUMBER(SEARCH(\"Draft shortened TPP\",'Data extraction-synthesis'!L29)),\"X\",\"\")","v":""},{"$f":"IF(ISNUMBER(SEARCH(\"Presentation of shortened TPP to large stakeholder audience\",'Data extraction-synthesis'!L29)),\"X\",\"\")","v":""},{"$f":"IF(ISNUMBER(SEARCH(\"Identification of most important needs\",'Data extraction-synthesis'!L29)),\"X\",\"\")","v":""},{"$f":"IF(ISNUMBER(SEARCH(\"Prioritization exercise\",'Data extraction-synthesis'!L29)),\"X\",\"\")","v":""},{"$f":"IF(ISNUMBER(SEARCH(\"Delphi-like approach to gauge stakeholders’ agreement with the TPP\",'Data extraction-synthesis'!L29)),\"X\",\"\")","v":""},{"$f":"IF(ISNUMBER(SEARCH(\"Data analysis\",'Data extraction-synthesis'!L29)),\"X\",\"\")","v":""},{"$f":"IF(ISNUMBER(SEARCH(\"Definition problem statement/use case  \",'Data extraction-synthesis'!L29)),\"X\",\"\")","v":"X"},{"$f":"IF(ISNUMBER(SEARCH(\"Identification of stakeholders to involve in draft TPP \",'Data extraction-synthesis'!L29)),\"X\",\"\")","v":""},{"$f":"IF(ISNUMBER(SEARCH(\"Definition TPP domains \",'Data extraction-synthesis'!L29)),\"X\",\"\")","v":""},{"$f":"IF(ISNUMBER(SEARCH(\"Survey to measure stakeholder’s preferences and agreement \",'Data extraction-synthesis'!L29)),\"X\",\"\")","v":""},{"$f":"IF(ISNUMBER(SEARCH(\"Reviewing available literature and data\",'Data extraction-synthesis'!L29)),\"X\",\"\")","v":""},{"$f":"IF(ISNUMBER(SEARCH(\"Defining scope TPP \",'Data extraction-synthesis'!L29)),\"X\",\"\")","v":""},{"$f":"IF(ISNUMBER(SEARCH(\"Interview with stakeholders\",'Data extraction-synthesis'!L29)),\"X\",\"\")","v":""},{"$f":"IF(ISNUMBER(SEARCH(\"Field research \",'Data extraction-synthesis'!L29)),\"X\",\"\")","v":""},{"$f":"IF(ISNUMBER(SEARCH(\"Consolidation of findings\",'Data extraction-synthesis'!L29)),\"X\",\"\")","v":""},{"$f":"IF(ISNUMBER(SEARCH(\"N/A\",'Data extraction-synthesis'!L29)),\"X\",\"\")","v":""}]
["Utzinger, J. B., S. L.: van Lieshout, L.: van Dam, G. J.: Knopp, S","New diagnostic tools in schistosomiasis",{"$f":"IF(ISNUMBER(SEARCH(\"Consensus/public meeting\",'Data extraction-synthesis'!L30)),\"X\",\"\")","v":""},{"$f":"IF(ISNUMBER(SEARCH(\"Meeting with experts/stakeholders\",'Data extraction-synthesis'!L30)),\"X\",\"\")","v":""},{"$f":"IF(ISNUMBER(SEARCH(\"Feedback from the consultation (e.g. survey, meeting, expert opinion) is incorporated into the final TPPs\",'Data extraction-synthesis'!L30)),\"X\",\"\")","v":""},{"$f":"IF(ISNUMBER(SEARCH(\"Mapping\",'Data extraction-synthesis'!L30)),\"X\",\"\")","v":""},{"$f":"IF(ISNUMBER(SEARCH(\"Market analyses\",'Data extraction-synthesis'!L30)),\"X\",\"\")","v":""},{"$f":"IF(ISNUMBER(SEARCH(\"Literature search\",'Data extraction-synthesis'!L30)),\"X\",\"\")","v":""},{"$f":"IF(ISNUMBER(SEARCH(\"Survey to retrieve input relevant for TPP\",'Data extraction-synthesis'!L30)),\"X\",\"\")","v":""},{"$f":"IF(ISNUMBER(SEARCH(\"Landscaping exercise\",'Data extraction-synthesis'!L30)),\"X\",\"\")","v":""},{"$f":"IF(ISNUMBER(SEARCH(\"Draft TPP\",'Data extraction-synthesis'!L30)),\"X\",\"\")","v":""},{"$f":"IF(ISNUMBER(SEARCH(\"Round of revisions of TPP\",'Data extraction-synthesis'!L30)),\"X\",\"\")","v":""},{"$f":"IF(ISNUMBER(SEARCH(\"Draft shortened TPP\",'Data extraction-synthesis'!L30)),\"X\",\"\")","v":""},{"$f":"IF(ISNUMBER(SEARCH(\"Presentation of shortened TPP to large stakeholder audience\",'Data extraction-synthesis'!L30)),\"X\",\"\")","v":""},{"$f":"IF(ISNUMBER(SEARCH(\"Identification of most important needs\",'Data extraction-synthesis'!L30)),\"X\",\"\")","v":""},{"$f":"IF(ISNUMBER(SEARCH(\"Prioritization exercise\",'Data extraction-synthesis'!L30)),\"X\",\"\")","v":""},{"$f":"IF(ISNUMBER(SEARCH(\"Delphi-like approach to gauge stakeholders’ agreement with the TPP\",'Data extraction-synthesis'!L30)),\"X\",\"\")","v":""},{"$f":"IF(ISNUMBER(SEARCH(\"Data analysis\",'Data extraction-synthesis'!L30)),\"X\",\"\")","v":""},{"$f":"IF(ISNUMBER(SEARCH(\"Definition problem statement/use case  \",'Data extraction-synthesis'!L30)),\"X\",\"\")","v":""},{"$f":"IF(ISNUMBER(SEARCH(\"Identification of stakeholders to involve in draft TPP \",'Data extraction-synthesis'!L30)),\"X\",\"\")","v":""},{"$f":"IF(ISNUMBER(SEARCH(\"Definition TPP domains \",'Data extraction-synthesis'!L30)),\"X\",\"\")","v":""},{"$f":"IF(ISNUMBER(SEARCH(\"Survey to measure stakeholder’s preferences and agreement \",'Data extraction-synthesis'!L30)),\"X\",\"\")","v":""},{"$f":"IF(ISNUMBER(SEARCH(\"Reviewing available literature and data\",'Data extraction-synthesis'!L30)),\"X\",\"\")","v":""},{"$f":"IF(ISNUMBER(SEARCH(\"Defining scope TPP \",'Data extraction-synthesis'!L30)),\"X\",\"\")","v":""},{"$f":"IF(ISNUMBER(SEARCH(\"Interview with stakeholders\",'Data extraction-synthesis'!L30)),\"X\",\"\")","v":""},{"$f":"IF(ISNUMBER(SEARCH(\"Field research \",'Data extraction-synthesis'!L30)),\"X\",\"\")","v":""},{"$f":"IF(ISNUMBER(SEARCH(\"Consolidation of findings\",'Data extraction-synthesis'!L30)),\"X\",\"\")","v":""},{"$f":"IF(ISNUMBER(SEARCH(\"N/A\",'Data extraction-synthesis'!L30)),\"X\",\"\")","v":"X"}]
["UNICEF","Zika Virus Diagnostics: Target Product Profiles & Supply Update",{"$f":"IF(ISNUMBER(SEARCH(\"Consensus/public meeting\",'Data extraction-synthesis'!L31)),\"X\",\"\")","v":""},{"$f":"IF(ISNUMBER(SEARCH(\"Meeting with experts/stakeholders\",'Data extraction-synthesis'!L31)),\"X\",\"\")","v":""},{"$f":"IF(ISNUMBER(SEARCH(\"Feedback from the consultation (e.g. survey, meeting, expert opinion) is incorporated into the final TPPs\",'Data extraction-synthesis'!L31)),\"X\",\"\")","v":"X"},{"$f":"IF(ISNUMBER(SEARCH(\"Mapping\",'Data extraction-synthesis'!L31)),\"X\",\"\")","v":""},{"$f":"IF(ISNUMBER(SEARCH(\"Market analyses\",'Data extraction-synthesis'!L31)),\"X\",\"\")","v":""},{"$f":"IF(ISNUMBER(SEARCH(\"Literature search\",'Data extraction-synthesis'!L31)),\"X\",\"\")","v":""},{"$f":"IF(ISNUMBER(SEARCH(\"Survey to retrieve input relevant for TPP\",'Data extraction-synthesis'!L31)),\"X\",\"\")","v":""},{"$f":"IF(ISNUMBER(SEARCH(\"Landscaping exercise\",'Data extraction-synthesis'!L31)),\"X\",\"\")","v":""},{"$f":"IF(ISNUMBER(SEARCH(\"Draft TPP\",'Data extraction-synthesis'!L31)),\"X\",\"\")","v":"X"},{"$f":"IF(ISNUMBER(SEARCH(\"Round of revisions of TPP\",'Data extraction-synthesis'!L31)),\"X\",\"\")","v":"X"},{"$f":"IF(ISNUMBER(SEARCH(\"Draft shortened TPP\",'Data extraction-synthesis'!L31)),\"X\",\"\")","v":""},{"$f":"IF(ISNUMBER(SEARCH(\"Presentation of shortened TPP to large stakeholder audience\",'Data extraction-synthesis'!L31)),\"X\",\"\")","v":""},{"$f":"IF(ISNUMBER(SEARCH(\"Identification of most important needs\",'Data extraction-synthesis'!L31)),\"X\",\"\")","v":""},{"$f":"IF(ISNUMBER(SEARCH(\"Prioritization exercise\",'Data extraction-synthesis'!L31)),\"X\",\"\")","v":""},{"$f":"IF(ISNUMBER(SEARCH(\"Delphi-like approach to gauge stakeholders’ agreement with the TPP\",'Data extraction-synthesis'!L31)),\"X\",\"\")","v":""},{"$f":"IF(ISNUMBER(SEARCH(\"Data analysis\",'Data extraction-synthesis'!L31)),\"X\",\"\")","v":""},{"$f":"IF(ISNUMBER(SEARCH(\"Definition problem statement/use case  \",'Data extraction-synthesis'!L31)),\"X\",\"\")","v":""},{"$f":"IF(ISNUMBER(SEARCH(\"Identification of stakeholders to involve in draft TPP \",'Data extraction-synthesis'!L31)),\"X\",\"\")","v":""},{"$f":"IF(ISNUMBER(SEARCH(\"Definition TPP domains \",'Data extraction-synthesis'!L31)),\"X\",\"\")","v":""},{"$f":"IF(ISNUMBER(SEARCH(\"Survey to measure stakeholder’s preferences and agreement \",'Data extraction-synthesis'!L31)),\"X\",\"\")","v":""},{"$f":"IF(ISNUMBER(SEARCH(\"Reviewing available literature and data\",'Data extraction-synthesis'!L31)),\"X\",\"\")","v":""},{"$f":"IF(ISNUMBER(SEARCH(\"Defining scope TPP \",'Data extraction-synthesis'!L31)),\"X\",\"\")","v":"X"},{"$f":"IF(ISNUMBER(SEARCH(\"Interview with stakeholders\",'Data extraction-synthesis'!L31)),\"X\",\"\")","v":""},{"$f":"IF(ISNUMBER(SEARCH(\"Field research \",'Data extraction-synthesis'!L31)),\"X\",\"\")","v":""},{"$f":"IF(ISNUMBER(SEARCH(\"Consolidation of findings\",'Data extraction-synthesis'!L31)),\"X\",\"\")","v":""},{"$f":"IF(ISNUMBER(SEARCH(\"N/A\",'Data extraction-synthesis'!L31)),\"X\",\"\")","v":""}]
["UNICEF","Pneumonia Acute Respiratory Infection Diagnostic Aid-Target Product Profile Introduction",{"$f":"IF(ISNUMBER(SEARCH(\"Consensus/public meeting\",'Data extraction-synthesis'!L32)),\"X\",\"\")","v":""},{"$f":"IF(ISNUMBER(SEARCH(\"Meeting with experts/stakeholders\",'Data extraction-synthesis'!L32)),\"X\",\"\")","v":""},{"$f":"IF(ISNUMBER(SEARCH(\"Feedback from the consultation (e.g. survey, meeting, expert opinion) is incorporated into the final TPPs\",'Data extraction-synthesis'!L32)),\"X\",\"\")","v":""},{"$f":"IF(ISNUMBER(SEARCH(\"Mapping\",'Data extraction-synthesis'!L32)),\"X\",\"\")","v":""},{"$f":"IF(ISNUMBER(SEARCH(\"Market analyses\",'Data extraction-synthesis'!L32)),\"X\",\"\")","v":""},{"$f":"IF(ISNUMBER(SEARCH(\"Literature search\",'Data extraction-synthesis'!L32)),\"X\",\"\")","v":""},{"$f":"IF(ISNUMBER(SEARCH(\"Survey to retrieve input relevant for TPP\",'Data extraction-synthesis'!L32)),\"X\",\"\")","v":""},{"$f":"IF(ISNUMBER(SEARCH(\"Landscaping exercise\",'Data extraction-synthesis'!L32)),\"X\",\"\")","v":""},{"$f":"IF(ISNUMBER(SEARCH(\"Draft TPP\",'Data extraction-synthesis'!L32)),\"X\",\"\")","v":"X"},{"$f":"IF(ISNUMBER(SEARCH(\"Round of revisions of TPP\",'Data extraction-synthesis'!L32)),\"X\",\"\")","v":"X"},{"$f":"IF(ISNUMBER(SEARCH(\"Draft shortened TPP\",'Data extraction-synthesis'!L32)),\"X\",\"\")","v":""},{"$f":"IF(ISNUMBER(SEARCH(\"Presentation of shortened TPP to large stakeholder audience\",'Data extraction-synthesis'!L32)),\"X\",\"\")","v":""},{"$f":"IF(ISNUMBER(SEARCH(\"Identification of most important needs\",'Data extraction-synthesis'!L32)),\"X\",\"\")","v":""},{"$f":"IF(ISNUMBER(SEARCH(\"Prioritization exercise\",'Data extraction-synthesis'!L32)),\"X\",\"\")","v":""},{"$f":"IF(ISNUMBER(SEARCH(\"Delphi-like approach to gauge stakeholders’ agreement with the TPP\",'Data extraction-synthesis'!L32)),\"X\",\"\")","v":""},{"$f":"IF(ISNUMBER(SEARCH(\"Data analysis\",'Data extraction-synthesis'!L32)),\"X\",\"\")","v":""},{"$f":"IF(ISNUMBER(SEARCH(\"Definition problem statement/use case  \",'Data extraction-synthesis'!L32)),\"X\",\"\")","v":""},{"$f":"IF(ISNUMBER(SEARCH(\"Identification of stakeholders to involve in draft TPP \",'Data extraction-synthesis'!L32)),\"X\",\"\")","v":""},{"$f":"IF(ISNUMBER(SEARCH(\"Definition TPP domains \",'Data extraction-synthesis'!L32)),\"X\",\"\")","v":""},{"$f":"IF(ISNUMBER(SEARCH(\"Survey to measure stakeholder’s preferences and agreement \",'Data extraction-synthesis'!L32)),\"X\",\"\")","v":"X"},{"$f":"IF(ISNUMBER(SEARCH(\"Reviewing available literature and data\",'Data extraction-synthesis'!L32)),\"X\",\"\")","v":"X"},{"$f":"IF(ISNUMBER(SEARCH(\"Defining scope TPP \",'Data extraction-synthesis'!L32)),\"X\",\"\")","v":"X"},{"$f":"IF(ISNUMBER(SEARCH(\"Interview with stakeholders\",'Data extraction-synthesis'!L32)),\"X\",\"\")","v":""},{"$f":"IF(ISNUMBER(SEARCH(\"Field research \",'Data extraction-synthesis'!L32)),\"X\",\"\")","v":""},{"$f":"IF(ISNUMBER(SEARCH(\"Consolidation of findings\",'Data extraction-synthesis'!L32)),\"X\",\"\")","v":""},{"$f":"IF(ISNUMBER(SEARCH(\"N/A\",'Data extraction-synthesis'!L32)),\"X\",\"\")","v":""}]
["Pal S, Jasper L.E., Lawrence K.L, Walter M","Assessing the Dengue Diagnosis Capability Gap in the Military Health System",{"$f":"IF(ISNUMBER(SEARCH(\"Consensus/public meeting\",'Data extraction-synthesis'!L33)),\"X\",\"\")","v":""},{"$f":"IF(ISNUMBER(SEARCH(\"Meeting with experts/stakeholders\",'Data extraction-synthesis'!L33)),\"X\",\"\")","v":""},{"$f":"IF(ISNUMBER(SEARCH(\"Feedback from the consultation (e.g. survey, meeting, expert opinion) is incorporated into the final TPPs\",'Data extraction-synthesis'!L33)),\"X\",\"\")","v":""},{"$f":"IF(ISNUMBER(SEARCH(\"Mapping\",'Data extraction-synthesis'!L33)),\"X\",\"\")","v":""},{"$f":"IF(ISNUMBER(SEARCH(\"Market analyses\",'Data extraction-synthesis'!L33)),\"X\",\"\")","v":""},{"$f":"IF(ISNUMBER(SEARCH(\"Literature search\",'Data extraction-synthesis'!L33)),\"X\",\"\")","v":""},{"$f":"IF(ISNUMBER(SEARCH(\"Survey to retrieve input relevant for TPP\",'Data extraction-synthesis'!L33)),\"X\",\"\")","v":""},{"$f":"IF(ISNUMBER(SEARCH(\"Landscaping exercise\",'Data extraction-synthesis'!L33)),\"X\",\"\")","v":""},{"$f":"IF(ISNUMBER(SEARCH(\"Draft TPP\",'Data extraction-synthesis'!L33)),\"X\",\"\")","v":"X"},{"$f":"IF(ISNUMBER(SEARCH(\"Round of revisions of TPP\",'Data extraction-synthesis'!L33)),\"X\",\"\")","v":""},{"$f":"IF(ISNUMBER(SEARCH(\"Draft shortened TPP\",'Data extraction-synthesis'!L33)),\"X\",\"\")","v":""},{"$f":"IF(ISNUMBER(SEARCH(\"Presentation of shortened TPP to large stakeholder audience\",'Data extraction-synthesis'!L33)),\"X\",\"\")","v":""},{"$f":"IF(ISNUMBER(SEARCH(\"Identification of most important needs\",'Data extraction-synthesis'!L33)),\"X\",\"\")","v":"X"},{"$f":"IF(ISNUMBER(SEARCH(\"Prioritization exercise\",'Data extraction-synthesis'!L33)),\"X\",\"\")","v":""},{"$f":"IF(ISNUMBER(SEARCH(\"Delphi-like approach to gauge stakeholders’ agreement with the TPP\",'Data extraction-synthesis'!L33)),\"X\",\"\")","v":""},{"$f":"IF(ISNUMBER(SEARCH(\"Data analysis\",'Data extraction-synthesis'!L33)),\"X\",\"\")","v":""},{"$f":"IF(ISNUMBER(SEARCH(\"Definition problem statement/use case  \",'Data extraction-synthesis'!L33)),\"X\",\"\")","v":""},{"$f":"IF(ISNUMBER(SEARCH(\"Identification of stakeholders to involve in draft TPP \",'Data extraction-synthesis'!L33)),\"X\",\"\")","v":""},{"$f":"IF(ISNUMBER(SEARCH(\"Definition TPP domains \",'Data extraction-synthesis'!L33)),\"X\",\"\")","v":""},{"$f":"IF(ISNUMBER(SEARCH(\"Survey to measure stakeholder’s preferences and agreement \",'Data extraction-synthesis'!L33)),\"X\",\"\")","v":""},{"$f":"IF(ISNUMBER(SEARCH(\"Reviewing available literature and data\",'Data extraction-synthesis'!L33)),\"X\",\"\")","v":""},{"$f":"IF(ISNUMBER(SEARCH(\"Defining scope TPP \",'Data extraction-synthesis'!L33)),\"X\",\"\")","v":""},{"$f":"IF(ISNUMBER(SEARCH(\"Interview with stakeholders\",'Data extraction-synthesis'!L33)),\"X\",\"\")","v":""},{"$f":"IF(ISNUMBER(SEARCH(\"Field research \",'Data extraction-synthesis'!L33)),\"X\",\"\")","v":""},{"$f":"IF(ISNUMBER(SEARCH(\"Consolidation of findings\",'Data extraction-synthesis'!L33)),\"X\",\"\")","v":""},{"$f":"IF(ISNUMBER(SEARCH(\"N/A\",'Data extraction-synthesis'!L33)),\"X\",\"\")","v":""}]
["PATH","Target Product Profile: Schistosomiasis Surveillance Diagnostic Lateral Flow Test CAA antigen",{"$f":"IF(ISNUMBER(SEARCH(\"Consensus/public meeting\",'Data extraction-synthesis'!L34)),\"X\",\"\")","v":""},{"$f":"IF(ISNUMBER(SEARCH(\"Meeting with experts/stakeholders\",'Data extraction-synthesis'!L34)),\"X\",\"\")","v":""},{"$f":"IF(ISNUMBER(SEARCH(\"Feedback from the consultation (e.g. survey, meeting, expert opinion) is incorporated into the final TPPs\",'Data extraction-synthesis'!L34)),\"X\",\"\")","v":""},{"$f":"IF(ISNUMBER(SEARCH(\"Mapping\",'Data extraction-synthesis'!L34)),\"X\",\"\")","v":""},{"$f":"IF(ISNUMBER(SEARCH(\"Market analyses\",'Data extraction-synthesis'!L34)),\"X\",\"\")","v":""},{"$f":"IF(ISNUMBER(SEARCH(\"Literature search\",'Data extraction-synthesis'!L34)),\"X\",\"\")","v":""},{"$f":"IF(ISNUMBER(SEARCH(\"Survey to retrieve input relevant for TPP\",'Data extraction-synthesis'!L34)),\"X\",\"\")","v":""},{"$f":"IF(ISNUMBER(SEARCH(\"Landscaping exercise\",'Data extraction-synthesis'!L34)),\"X\",\"\")","v":""},{"$f":"IF(ISNUMBER(SEARCH(\"Draft TPP\",'Data extraction-synthesis'!L34)),\"X\",\"\")","v":""},{"$f":"IF(ISNUMBER(SEARCH(\"Round of revisions of TPP\",'Data extraction-synthesis'!L34)),\"X\",\"\")","v":""},{"$f":"IF(ISNUMBER(SEARCH(\"Draft shortened TPP\",'Data extraction-synthesis'!L34)),\"X\",\"\")","v":""},{"$f":"IF(ISNUMBER(SEARCH(\"Presentation of shortened TPP to large stakeholder audience\",'Data extraction-synthesis'!L34)),\"X\",\"\")","v":""},{"$f":"IF(ISNUMBER(SEARCH(\"Identification of most important needs\",'Data extraction-synthesis'!L34)),\"X\",\"\")","v":""},{"$f":"IF(ISNUMBER(SEARCH(\"Prioritization exercise\",'Data extraction-synthesis'!L34)),\"X\",\"\")","v":""},{"$f":"IF(ISNUMBER(SEARCH(\"Delphi-like approach to gauge stakeholders’ agreement with the TPP\",'Data extraction-synthesis'!L34)),\"X\",\"\")","v":""},{"$f":"IF(ISNUMBER(SEARCH(\"Data analysis\",'Data extraction-synthesis'!L34)),\"X\",\"\")","v":""},{"$f":"IF(ISNUMBER(SEARCH(\"Definition problem statement/use case  \",'Data extraction-synthesis'!L34)),\"X\",\"\")","v":""},{"$f":"IF(ISNUMBER(SEARCH(\"Identification of stakeholders to involve in draft TPP \",'Data extraction-synthesis'!L34)),\"X\",\"\")","v":""},{"$f":"IF(ISNUMBER(SEARCH(\"Definition TPP domains \",'Data extraction-synthesis'!L34)),\"X\",\"\")","v":""},{"$f":"IF(ISNUMBER(SEARCH(\"Survey to measure stakeholder’s preferences and agreement \",'Data extraction-synthesis'!L34)),\"X\",\"\")","v":""},{"$f":"IF(ISNUMBER(SEARCH(\"Reviewing available literature and data\",'Data extraction-synthesis'!L34)),\"X\",\"\")","v":""},{"$f":"IF(ISNUMBER(SEARCH(\"Defining scope TPP \",'Data extraction-synthesis'!L34)),\"X\",\"\")","v":""},{"$f":"IF(ISNUMBER(SEARCH(\"Interview with stakeholders\",'Data extraction-synthesis'!L34)),\"X\",\"\")","v":""},{"$f":"IF(ISNUMBER(SEARCH(\"Field research \",'Data extraction-synthesis'!L34)),\"X\",\"\")","v":""},{"$f":"IF(ISNUMBER(SEARCH(\"Consolidation of findings\",'Data extraction-synthesis'!L34)),\"X\",\"\")","v":""},{"$f":"IF(ISNUMBER(SEARCH(\"N/A\",'Data extraction-synthesis'!L34)),\"X\",\"\")","v":"X"}]
["PATH","Target Product Profile: Trachoma Surveillance Diagnostic-Post-Elimination Surveillance Antibody Lateral Flow Test",{"$f":"IF(ISNUMBER(SEARCH(\"Consensus/public meeting\",'Data extraction-synthesis'!L35)),\"X\",\"\")","v":""},{"$f":"IF(ISNUMBER(SEARCH(\"Meeting with experts/stakeholders\",'Data extraction-synthesis'!L35)),\"X\",\"\")","v":""},{"$f":"IF(ISNUMBER(SEARCH(\"Feedback from the consultation (e.g. survey, meeting, expert opinion) is incorporated into the final TPPs\",'Data extraction-synthesis'!L35)),\"X\",\"\")","v":""},{"$f":"IF(ISNUMBER(SEARCH(\"Mapping\",'Data extraction-synthesis'!L35)),\"X\",\"\")","v":""},{"$f":"IF(ISNUMBER(SEARCH(\"Market analyses\",'Data extraction-synthesis'!L35)),\"X\",\"\")","v":""},{"$f":"IF(ISNUMBER(SEARCH(\"Literature search\",'Data extraction-synthesis'!L35)),\"X\",\"\")","v":""},{"$f":"IF(ISNUMBER(SEARCH(\"Survey to retrieve input relevant for TPP\",'Data extraction-synthesis'!L35)),\"X\",\"\")","v":""},{"$f":"IF(ISNUMBER(SEARCH(\"Landscaping exercise\",'Data extraction-synthesis'!L35)),\"X\",\"\")","v":""},{"$f":"IF(ISNUMBER(SEARCH(\"Draft TPP\",'Data extraction-synthesis'!L35)),\"X\",\"\")","v":""},{"$f":"IF(ISNUMBER(SEARCH(\"Round of revisions of TPP\",'Data extraction-synthesis'!L35)),\"X\",\"\")","v":""},{"$f":"IF(ISNUMBER(SEARCH(\"Draft shortened TPP\",'Data extraction-synthesis'!L35)),\"X\",\"\")","v":""},{"$f":"IF(ISNUMBER(SEARCH(\"Presentation of shortened TPP to large stakeholder audience\",'Data extraction-synthesis'!L35)),\"X\",\"\")","v":""},{"$f":"IF(ISNUMBER(SEARCH(\"Identification of most important needs\",'Data extraction-synthesis'!L35)),\"X\",\"\")","v":""},{"$f":"IF(ISNUMBER(SEARCH(\"Prioritization exercise\",'Data extraction-synthesis'!L35)),\"X\",\"\")","v":""},{"$f":"IF(ISNUMBER(SEARCH(\"Delphi-like approach to gauge stakeholders’ agreement with the TPP\",'Data extraction-synthesis'!L35)),\"X\",\"\")","v":""},{"$f":"IF(ISNUMBER(SEARCH(\"Data analysis\",'Data extraction-synthesis'!L35)),\"X\",\"\")","v":""},{"$f":"IF(ISNUMBER(SEARCH(\"Definition problem statement/use case  \",'Data extraction-synthesis'!L35)),\"X\",\"\")","v":""},{"$f":"IF(ISNUMBER(SEARCH(\"Identification of stakeholders to involve in draft TPP \",'Data extraction-synthesis'!L35)),\"X\",\"\")","v":""},{"$f":"IF(ISNUMBER(SEARCH(\"Definition TPP domains \",'Data extraction-synthesis'!L35)),\"X\",\"\")","v":""},{"$f":"IF(ISNUMBER(SEARCH(\"Survey to measure stakeholder’s preferences and agreement \",'Data extraction-synthesis'!L35)),\"X\",\"\")","v":""},{"$f":"IF(ISNUMBER(SEARCH(\"Reviewing available literature and data\",'Data extraction-synthesis'!L35)),\"X\",\"\")","v":""},{"$f":"IF(ISNUMBER(SEARCH(\"Defining scope TPP \",'Data extraction-synthesis'!L35)),\"X\",\"\")","v":""},{"$f":"IF(ISNUMBER(SEARCH(\"Interview with stakeholders\",'Data extraction-synthesis'!L35)),\"X\",\"\")","v":""},{"$f":"IF(ISNUMBER(SEARCH(\"Field research \",'Data extraction-synthesis'!L35)),\"X\",\"\")","v":""},{"$f":"IF(ISNUMBER(SEARCH(\"Consolidation of findings\",'Data extraction-synthesis'!L35)),\"X\",\"\")","v":""},{"$f":"IF(ISNUMBER(SEARCH(\"N/A\",'Data extraction-synthesis'!L35)),\"X\",\"\")","v":"X"}]
["International Diagnostics Centre (IDC)","Target Product Profile (TPP) - Point-of-Care HIV Viral Load Test",{"$f":"IF(ISNUMBER(SEARCH(\"Consensus/public meeting\",'Data extraction-synthesis'!L36)),\"X\",\"\")","v":""},{"$f":"IF(ISNUMBER(SEARCH(\"Meeting with experts/stakeholders\",'Data extraction-synthesis'!L36)),\"X\",\"\")","v":""},{"$f":"IF(ISNUMBER(SEARCH(\"Feedback from the consultation (e.g. survey, meeting, expert opinion) is incorporated into the final TPPs\",'Data extraction-synthesis'!L36)),\"X\",\"\")","v":""},{"$f":"IF(ISNUMBER(SEARCH(\"Mapping\",'Data extraction-synthesis'!L36)),\"X\",\"\")","v":""},{"$f":"IF(ISNUMBER(SEARCH(\"Market analyses\",'Data extraction-synthesis'!L36)),\"X\",\"\")","v":""},{"$f":"IF(ISNUMBER(SEARCH(\"Literature search\",'Data extraction-synthesis'!L36)),\"X\",\"\")","v":""},{"$f":"IF(ISNUMBER(SEARCH(\"Survey to retrieve input relevant for TPP\",'Data extraction-synthesis'!L36)),\"X\",\"\")","v":""},{"$f":"IF(ISNUMBER(SEARCH(\"Landscaping exercise\",'Data extraction-synthesis'!L36)),\"X\",\"\")","v":""},{"$f":"IF(ISNUMBER(SEARCH(\"Draft TPP\",'Data extraction-synthesis'!L36)),\"X\",\"\")","v":""},{"$f":"IF(ISNUMBER(SEARCH(\"Round of revisions of TPP\",'Data extraction-synthesis'!L36)),\"X\",\"\")","v":""},{"$f":"IF(ISNUMBER(SEARCH(\"Draft shortened TPP\",'Data extraction-synthesis'!L36)),\"X\",\"\")","v":""},{"$f":"IF(ISNUMBER(SEARCH(\"Presentation of shortened TPP to large stakeholder audience\",'Data extraction-synthesis'!L36)),\"X\",\"\")","v":""},{"$f":"IF(ISNUMBER(SEARCH(\"Identification of most important needs\",'Data extraction-synthesis'!L36)),\"X\",\"\")","v":""},{"$f":"IF(ISNUMBER(SEARCH(\"Prioritization exercise\",'Data extraction-synthesis'!L36)),\"X\",\"\")","v":""},{"$f":"IF(ISNUMBER(SEARCH(\"Delphi-like approach to gauge stakeholders’ agreement with the TPP\",'Data extraction-synthesis'!L36)),\"X\",\"\")","v":""},{"$f":"IF(ISNUMBER(SEARCH(\"Data analysis\",'Data extraction-synthesis'!L36)),\"X\",\"\")","v":""},{"$f":"IF(ISNUMBER(SEARCH(\"Definition problem statement/use case  \",'Data extraction-synthesis'!L36)),\"X\",\"\")","v":""},{"$f":"IF(ISNUMBER(SEARCH(\"Identification of stakeholders to involve in draft TPP \",'Data extraction-synthesis'!L36)),\"X\",\"\")","v":""},{"$f":"IF(ISNUMBER(SEARCH(\"Definition TPP domains \",'Data extraction-synthesis'!L36)),\"X\",\"\")","v":""},{"$f":"IF(ISNUMBER(SEARCH(\"Survey to measure stakeholder’s preferences and agreement \",'Data extraction-synthesis'!L36)),\"X\",\"\")","v":""},{"$f":"IF(ISNUMBER(SEARCH(\"Reviewing available literature and data\",'Data extraction-synthesis'!L36)),\"X\",\"\")","v":""},{"$f":"IF(ISNUMBER(SEARCH(\"Defining scope TPP \",'Data extraction-synthesis'!L36)),\"X\",\"\")","v":""},{"$f":"IF(ISNUMBER(SEARCH(\"Interview with stakeholders\",'Data extraction-synthesis'!L36)),\"X\",\"\")","v":""},{"$f":"IF(ISNUMBER(SEARCH(\"Field research \",'Data extraction-synthesis'!L36)),\"X\",\"\")","v":""},{"$f":"IF(ISNUMBER(SEARCH(\"Consolidation of findings\",'Data extraction-synthesis'!L36)),\"X\",\"\")","v":""},{"$f":"IF(ISNUMBER(SEARCH(\"N/A\",'Data extraction-synthesis'!L36)),\"X\",\"\")","v":"X"}]
["International Diagnostics Centre (IDC)","Target Product Profile (TPP)- Point of care CD4 test",{"$f":"IF(ISNUMBER(SEARCH(\"Consensus/public meeting\",'Data extraction-synthesis'!L37)),\"X\",\"\")","v":""},{"$f":"IF(ISNUMBER(SEARCH(\"Meeting with experts/stakeholders\",'Data extraction-synthesis'!L37)),\"X\",\"\")","v":""},{"$f":"IF(ISNUMBER(SEARCH(\"Feedback from the consultation (e.g. survey, meeting, expert opinion) is incorporated into the final TPPs\",'Data extraction-synthesis'!L37)),\"X\",\"\")","v":""},{"$f":"IF(ISNUMBER(SEARCH(\"Mapping\",'Data extraction-synthesis'!L37)),\"X\",\"\")","v":""},{"$f":"IF(ISNUMBER(SEARCH(\"Market analyses\",'Data extraction-synthesis'!L37)),\"X\",\"\")","v":""},{"$f":"IF(ISNUMBER(SEARCH(\"Literature search\",'Data extraction-synthesis'!L37)),\"X\",\"\")","v":""},{"$f":"IF(ISNUMBER(SEARCH(\"Survey to retrieve input relevant for TPP\",'Data extraction-synthesis'!L37)),\"X\",\"\")","v":""},{"$f":"IF(ISNUMBER(SEARCH(\"Landscaping exercise\",'Data extraction-synthesis'!L37)),\"X\",\"\")","v":""},{"$f":"IF(ISNUMBER(SEARCH(\"Draft TPP\",'Data extraction-synthesis'!L37)),\"X\",\"\")","v":""},{"$f":"IF(ISNUMBER(SEARCH(\"Round of revisions of TPP\",'Data extraction-synthesis'!L37)),\"X\",\"\")","v":""},{"$f":"IF(ISNUMBER(SEARCH(\"Draft shortened TPP\",'Data extraction-synthesis'!L37)),\"X\",\"\")","v":""},{"$f":"IF(ISNUMBER(SEARCH(\"Presentation of shortened TPP to large stakeholder audience\",'Data extraction-synthesis'!L37)),\"X\",\"\")","v":""},{"$f":"IF(ISNUMBER(SEARCH(\"Identification of most important needs\",'Data extraction-synthesis'!L37)),\"X\",\"\")","v":""},{"$f":"IF(ISNUMBER(SEARCH(\"Prioritization exercise\",'Data extraction-synthesis'!L37)),\"X\",\"\")","v":""},{"$f":"IF(ISNUMBER(SEARCH(\"Delphi-like approach to gauge stakeholders’ agreement with the TPP\",'Data extraction-synthesis'!L37)),\"X\",\"\")","v":""},{"$f":"IF(ISNUMBER(SEARCH(\"Data analysis\",'Data extraction-synthesis'!L37)),\"X\",\"\")","v":""},{"$f":"IF(ISNUMBER(SEARCH(\"Definition problem statement/use case  \",'Data extraction-synthesis'!L37)),\"X\",\"\")","v":""},{"$f":"IF(ISNUMBER(SEARCH(\"Identification of stakeholders to involve in draft TPP \",'Data extraction-synthesis'!L37)),\"X\",\"\")","v":""},{"$f":"IF(ISNUMBER(SEARCH(\"Definition TPP domains \",'Data extraction-synthesis'!L37)),\"X\",\"\")","v":""},{"$f":"IF(ISNUMBER(SEARCH(\"Survey to measure stakeholder’s preferences and agreement \",'Data extraction-synthesis'!L37)),\"X\",\"\")","v":""},{"$f":"IF(ISNUMBER(SEARCH(\"Reviewing available literature and data\",'Data extraction-synthesis'!L37)),\"X\",\"\")","v":""},{"$f":"IF(ISNUMBER(SEARCH(\"Defining scope TPP \",'Data extraction-synthesis'!L37)),\"X\",\"\")","v":""},{"$f":"IF(ISNUMBER(SEARCH(\"Interview with stakeholders\",'Data extraction-synthesis'!L37)),\"X\",\"\")","v":""},{"$f":"IF(ISNUMBER(SEARCH(\"Field research \",'Data extraction-synthesis'!L37)),\"X\",\"\")","v":""},{"$f":"IF(ISNUMBER(SEARCH(\"Consolidation of findings\",'Data extraction-synthesis'!L37)),\"X\",\"\")","v":""},{"$f":"IF(ISNUMBER(SEARCH(\"N/A\",'Data extraction-synthesis'!L37)),\"X\",\"\")","v":"X"}]
["International Diagnostics Centre (IDC)","Target Product Profile (TPP): Point of care EID test",{"$f":"IF(ISNUMBER(SEARCH(\"Consensus/public meeting\",'Data extraction-synthesis'!L38)),\"X\",\"\")","v":""},{"$f":"IF(ISNUMBER(SEARCH(\"Meeting with experts/stakeholders\",'Data extraction-synthesis'!L38)),\"X\",\"\")","v":""},{"$f":"IF(ISNUMBER(SEARCH(\"Feedback from the consultation (e.g. survey, meeting, expert opinion) is incorporated into the final TPPs\",'Data extraction-synthesis'!L38)),\"X\",\"\")","v":""},{"$f":"IF(ISNUMBER(SEARCH(\"Mapping\",'Data extraction-synthesis'!L38)),\"X\",\"\")","v":""},{"$f":"IF(ISNUMBER(SEARCH(\"Market analyses\",'Data extraction-synthesis'!L38)),\"X\",\"\")","v":""},{"$f":"IF(ISNUMBER(SEARCH(\"Literature search\",'Data extraction-synthesis'!L38)),\"X\",\"\")","v":""},{"$f":"IF(ISNUMBER(SEARCH(\"Survey to retrieve input relevant for TPP\",'Data extraction-synthesis'!L38)),\"X\",\"\")","v":""},{"$f":"IF(ISNUMBER(SEARCH(\"Landscaping exercise\",'Data extraction-synthesis'!L38)),\"X\",\"\")","v":""},{"$f":"IF(ISNUMBER(SEARCH(\"Draft TPP\",'Data extraction-synthesis'!L38)),\"X\",\"\")","v":""},{"$f":"IF(ISNUMBER(SEARCH(\"Round of revisions of TPP\",'Data extraction-synthesis'!L38)),\"X\",\"\")","v":""},{"$f":"IF(ISNUMBER(SEARCH(\"Draft shortened TPP\",'Data extraction-synthesis'!L38)),\"X\",\"\")","v":""},{"$f":"IF(ISNUMBER(SEARCH(\"Presentation of shortened TPP to large stakeholder audience\",'Data extraction-synthesis'!L38)),\"X\",\"\")","v":""},{"$f":"IF(ISNUMBER(SEARCH(\"Identification of most important needs\",'Data extraction-synthesis'!L38)),\"X\",\"\")","v":""},{"$f":"IF(ISNUMBER(SEARCH(\"Prioritization exercise\",'Data extraction-synthesis'!L38)),\"X\",\"\")","v":""},{"$f":"IF(ISNUMBER(SEARCH(\"Delphi-like approach to gauge stakeholders’ agreement with the TPP\",'Data extraction-synthesis'!L38)),\"X\",\"\")","v":""},{"$f":"IF(ISNUMBER(SEARCH(\"Data analysis\",'Data extraction-synthesis'!L38)),\"X\",\"\")","v":""},{"$f":"IF(ISNUMBER(SEARCH(\"Definition problem statement/use case  \",'Data extraction-synthesis'!L38)),\"X\",\"\")","v":""},{"$f":"IF(ISNUMBER(SEARCH(\"Identification of stakeholders to involve in draft TPP \",'Data extraction-synthesis'!L38)),\"X\",\"\")","v":""},{"$f":"IF(ISNUMBER(SEARCH(\"Definition TPP domains \",'Data extraction-synthesis'!L38)),\"X\",\"\")","v":""},{"$f":"IF(ISNUMBER(SEARCH(\"Survey to measure stakeholder’s preferences and agreement \",'Data extraction-synthesis'!L38)),\"X\",\"\")","v":""},{"$f":"IF(ISNUMBER(SEARCH(\"Reviewing available literature and data\",'Data extraction-synthesis'!L38)),\"X\",\"\")","v":""},{"$f":"IF(ISNUMBER(SEARCH(\"Defining scope TPP \",'Data extraction-synthesis'!L38)),\"X\",\"\")","v":""},{"$f":"IF(ISNUMBER(SEARCH(\"Interview with stakeholders\",'Data extraction-synthesis'!L38)),\"X\",\"\")","v":""},{"$f":"IF(ISNUMBER(SEARCH(\"Field research \",'Data extraction-synthesis'!L38)),\"X\",\"\")","v":""},{"$f":"IF(ISNUMBER(SEARCH(\"Consolidation of findings\",'Data extraction-synthesis'!L38)),\"X\",\"\")","v":""},{"$f":"IF(ISNUMBER(SEARCH(\"N/A\",'Data extraction-synthesis'!L38)),\"X\",\"\")","v":"X"}]
["Internationa Diagnostics Centre (IDC)","Target Product Profile (TPP): Combined HIV/Syphilis Test",{"$f":"IF(ISNUMBER(SEARCH(\"Consensus/public meeting\",'Data extraction-synthesis'!L39)),\"X\",\"\")","v":""},{"$f":"IF(ISNUMBER(SEARCH(\"Meeting with experts/stakeholders\",'Data extraction-synthesis'!L39)),\"X\",\"\")","v":""},{"$f":"IF(ISNUMBER(SEARCH(\"Feedback from the consultation (e.g. survey, meeting, expert opinion) is incorporated into the final TPPs\",'Data extraction-synthesis'!L39)),\"X\",\"\")","v":""},{"$f":"IF(ISNUMBER(SEARCH(\"Mapping\",'Data extraction-synthesis'!L39)),\"X\",\"\")","v":""},{"$f":"IF(ISNUMBER(SEARCH(\"Market analyses\",'Data extraction-synthesis'!L39)),\"X\",\"\")","v":""},{"$f":"IF(ISNUMBER(SEARCH(\"Literature search\",'Data extraction-synthesis'!L39)),\"X\",\"\")","v":""},{"$f":"IF(ISNUMBER(SEARCH(\"Survey to retrieve input relevant for TPP\",'Data extraction-synthesis'!L39)),\"X\",\"\")","v":""},{"$f":"IF(ISNUMBER(SEARCH(\"Landscaping exercise\",'Data extraction-synthesis'!L39)),\"X\",\"\")","v":""},{"$f":"IF(ISNUMBER(SEARCH(\"Draft TPP\",'Data extraction-synthesis'!L39)),\"X\",\"\")","v":""},{"$f":"IF(ISNUMBER(SEARCH(\"Round of revisions of TPP\",'Data extraction-synthesis'!L39)),\"X\",\"\")","v":""},{"$f":"IF(ISNUMBER(SEARCH(\"Draft shortened TPP\",'Data extraction-synthesis'!L39)),\"X\",\"\")","v":""},{"$f":"IF(ISNUMBER(SEARCH(\"Presentation of shortened TPP to large stakeholder audience\",'Data extraction-synthesis'!L39)),\"X\",\"\")","v":""},{"$f":"IF(ISNUMBER(SEARCH(\"Identification of most important needs\",'Data extraction-synthesis'!L39)),\"X\",\"\")","v":""},{"$f":"IF(ISNUMBER(SEARCH(\"Prioritization exercise\",'Data extraction-synthesis'!L39)),\"X\",\"\")","v":""},{"$f":"IF(ISNUMBER(SEARCH(\"Delphi-like approach to gauge stakeholders’ agreement with the TPP\",'Data extraction-synthesis'!L39)),\"X\",\"\")","v":""},{"$f":"IF(ISNUMBER(SEARCH(\"Data analysis\",'Data extraction-synthesis'!L39)),\"X\",\"\")","v":""},{"$f":"IF(ISNUMBER(SEARCH(\"Definition problem statement/use case  \",'Data extraction-synthesis'!L39)),\"X\",\"\")","v":""},{"$f":"IF(ISNUMBER(SEARCH(\"Identification of stakeholders to involve in draft TPP \",'Data extraction-synthesis'!L39)),\"X\",\"\")","v":""},{"$f":"IF(ISNUMBER(SEARCH(\"Definition TPP domains \",'Data extraction-synthesis'!L39)),\"X\",\"\")","v":""},{"$f":"IF(ISNUMBER(SEARCH(\"Survey to measure stakeholder’s preferences and agreement \",'Data extraction-synthesis'!L39)),\"X\",\"\")","v":""},{"$f":"IF(ISNUMBER(SEARCH(\"Reviewing available literature and data\",'Data extraction-synthesis'!L39)),\"X\",\"\")","v":""},{"$f":"IF(ISNUMBER(SEARCH(\"Defining scope TPP \",'Data extraction-synthesis'!L39)),\"X\",\"\")","v":""},{"$f":"IF(ISNUMBER(SEARCH(\"Interview with stakeholders\",'Data extraction-synthesis'!L39)),\"X\",\"\")","v":""},{"$f":"IF(ISNUMBER(SEARCH(\"Field research \",'Data extraction-synthesis'!L39)),\"X\",\"\")","v":""},{"$f":"IF(ISNUMBER(SEARCH(\"Consolidation of findings\",'Data extraction-synthesis'!L39)),\"X\",\"\")","v":""},{"$f":"IF(ISNUMBER(SEARCH(\"N/A\",'Data extraction-synthesis'!L39)),\"X\",\"\")","v":"X"}]
["Ebels, K. B. C., C.: Crudder, C. H.: McGray, S.: Magnuson, K.: Tietje, K.: Labarre, P","Incorporating user needs into product development for improved infection detection for malaria elimination programs",{"$f":"IF(ISNUMBER(SEARCH(\"Consensus/public meeting\",'Data extraction-synthesis'!L40)),\"X\",\"\")","v":""},{"$f":"IF(ISNUMBER(SEARCH(\"Meeting with experts/stakeholders\",'Data extraction-synthesis'!L40)),\"X\",\"\")","v":""},{"$f":"IF(ISNUMBER(SEARCH(\"Feedback from the consultation (e.g. survey, meeting, expert opinion) is incorporated into the final TPPs\",'Data extraction-synthesis'!L40)),\"X\",\"\")","v":""},{"$f":"IF(ISNUMBER(SEARCH(\"Mapping\",'Data extraction-synthesis'!L40)),\"X\",\"\")","v":""},{"$f":"IF(ISNUMBER(SEARCH(\"Market analyses\",'Data extraction-synthesis'!L40)),\"X\",\"\")","v":""},{"$f":"IF(ISNUMBER(SEARCH(\"Literature search\",'Data extraction-synthesis'!L40)),\"X\",\"\")","v":""},{"$f":"IF(ISNUMBER(SEARCH(\"Survey to retrieve input relevant for TPP\",'Data extraction-synthesis'!L40)),\"X\",\"\")","v":""},{"$f":"IF(ISNUMBER(SEARCH(\"Landscaping exercise\",'Data extraction-synthesis'!L40)),\"X\",\"\")","v":""},{"$f":"IF(ISNUMBER(SEARCH(\"Draft TPP\",'Data extraction-synthesis'!L40)),\"X\",\"\")","v":"X"},{"$f":"IF(ISNUMBER(SEARCH(\"Round of revisions of TPP\",'Data extraction-synthesis'!L40)),\"X\",\"\")","v":""},{"$f":"IF(ISNUMBER(SEARCH(\"Draft shortened TPP\",'Data extraction-synthesis'!L40)),\"X\",\"\")","v":""},{"$f":"IF(ISNUMBER(SEARCH(\"Presentation of shortened TPP to large stakeholder audience\",'Data extraction-synthesis'!L40)),\"X\",\"\")","v":""},{"$f":"IF(ISNUMBER(SEARCH(\"Identification of most important needs\",'Data extraction-synthesis'!L40)),\"X\",\"\")","v":""},{"$f":"IF(ISNUMBER(SEARCH(\"Prioritization exercise\",'Data extraction-synthesis'!L40)),\"X\",\"\")","v":""},{"$f":"IF(ISNUMBER(SEARCH(\"Delphi-like approach to gauge stakeholders’ agreement with the TPP\",'Data extraction-synthesis'!L40)),\"X\",\"\")","v":""},{"$f":"IF(ISNUMBER(SEARCH(\"Data analysis\",'Data extraction-synthesis'!L40)),\"X\",\"\")","v":""},{"$f":"IF(ISNUMBER(SEARCH(\"Definition problem statement/use case  \",'Data extraction-synthesis'!L40)),\"X\",\"\")","v":"X"},{"$f":"IF(ISNUMBER(SEARCH(\"Identification of stakeholders to involve in draft TPP \",'Data extraction-synthesis'!L40)),\"X\",\"\")","v":""},{"$f":"IF(ISNUMBER(SEARCH(\"Definition TPP domains \",'Data extraction-synthesis'!L40)),\"X\",\"\")","v":""},{"$f":"IF(ISNUMBER(SEARCH(\"Survey to measure stakeholder’s preferences and agreement \",'Data extraction-synthesis'!L40)),\"X\",\"\")","v":""},{"$f":"IF(ISNUMBER(SEARCH(\"Reviewing available literature and data\",'Data extraction-synthesis'!L40)),\"X\",\"\")","v":""},{"$f":"IF(ISNUMBER(SEARCH(\"Defining scope TPP \",'Data extraction-synthesis'!L40)),\"X\",\"\")","v":""},{"$f":"IF(ISNUMBER(SEARCH(\"Interview with stakeholders\",'Data extraction-synthesis'!L40)),\"X\",\"\")","v":""},{"$f":"IF(ISNUMBER(SEARCH(\"Field research \",'Data extraction-synthesis'!L40)),\"X\",\"\")","v":""},{"$f":"IF(ISNUMBER(SEARCH(\"Consolidation of findings\",'Data extraction-synthesis'!L40)),\"X\",\"\")","v":"X"},{"$f":"IF(ISNUMBER(SEARCH(\"N/A\",'Data extraction-synthesis'!L40)),\"X\",\"\")","v":""}]
["FIND","Target Product Profile: Screening test for human African trypanosomiasis (HAT)",{"$f":"IF(ISNUMBER(SEARCH(\"Consensus/public meeting\",'Data extraction-synthesis'!L41)),\"X\",\"\")","v":""},{"$f":"IF(ISNUMBER(SEARCH(\"Meeting with experts/stakeholders\",'Data extraction-synthesis'!L41)),\"X\",\"\")","v":""},{"$f":"IF(ISNUMBER(SEARCH(\"Feedback from the consultation (e.g. survey, meeting, expert opinion) is incorporated into the final TPPs\",'Data extraction-synthesis'!L41)),\"X\",\"\")","v":""},{"$f":"IF(ISNUMBER(SEARCH(\"Mapping\",'Data extraction-synthesis'!L41)),\"X\",\"\")","v":""},{"$f":"IF(ISNUMBER(SEARCH(\"Market analyses\",'Data extraction-synthesis'!L41)),\"X\",\"\")","v":""},{"$f":"IF(ISNUMBER(SEARCH(\"Literature search\",'Data extraction-synthesis'!L41)),\"X\",\"\")","v":""},{"$f":"IF(ISNUMBER(SEARCH(\"Survey to retrieve input relevant for TPP\",'Data extraction-synthesis'!L41)),\"X\",\"\")","v":""},{"$f":"IF(ISNUMBER(SEARCH(\"Landscaping exercise\",'Data extraction-synthesis'!L41)),\"X\",\"\")","v":""},{"$f":"IF(ISNUMBER(SEARCH(\"Draft TPP\",'Data extraction-synthesis'!L41)),\"X\",\"\")","v":"X"},{"$f":"IF(ISNUMBER(SEARCH(\"Round of revisions of TPP\",'Data extraction-synthesis'!L41)),\"X\",\"\")","v":""},{"$f":"IF(ISNUMBER(SEARCH(\"Draft shortened TPP\",'Data extraction-synthesis'!L41)),\"X\",\"\")","v":""},{"$f":"IF(ISNUMBER(SEARCH(\"Presentation of shortened TPP to large stakeholder audience\",'Data extraction-synthesis'!L41)),\"X\",\"\")","v":""},{"$f":"IF(ISNUMBER(SEARCH(\"Identification of most important needs\",'Data extraction-synthesis'!L41)),\"X\",\"\")","v":""},{"$f":"IF(ISNUMBER(SEARCH(\"Prioritization exercise\",'Data extraction-synthesis'!L41)),\"X\",\"\")","v":""},{"$f":"IF(ISNUMBER(SEARCH(\"Delphi-like approach to gauge stakeholders’ agreement with the TPP\",'Data extraction-synthesis'!L41)),\"X\",\"\")","v":"X"},{"$f":"IF(ISNUMBER(SEARCH(\"Data analysis\",'Data extraction-synthesis'!L41)),\"X\",\"\")","v":""},{"$f":"IF(ISNUMBER(SEARCH(\"Definition problem statement/use case  \",'Data extraction-synthesis'!L41)),\"X\",\"\")","v":""},{"$f":"IF(ISNUMBER(SEARCH(\"Identification of stakeholders to involve in draft TPP \",'Data extraction-synthesis'!L41)),\"X\",\"\")","v":""},{"$f":"IF(ISNUMBER(SEARCH(\"Definition TPP domains \",'Data extraction-synthesis'!L41)),\"X\",\"\")","v":""},{"$f":"IF(ISNUMBER(SEARCH(\"Survey to measure stakeholder’s preferences and agreement \",'Data extraction-synthesis'!L41)),\"X\",\"\")","v":""},{"$f":"IF(ISNUMBER(SEARCH(\"Reviewing available literature and data\",'Data extraction-synthesis'!L41)),\"X\",\"\")","v":""},{"$f":"IF(ISNUMBER(SEARCH(\"Defining scope TPP \",'Data extraction-synthesis'!L41)),\"X\",\"\")","v":""},{"$f":"IF(ISNUMBER(SEARCH(\"Interview with stakeholders\",'Data extraction-synthesis'!L41)),\"X\",\"\")","v":""},{"$f":"IF(ISNUMBER(SEARCH(\"Field research \",'Data extraction-synthesis'!L41)),\"X\",\"\")","v":""},{"$f":"IF(ISNUMBER(SEARCH(\"Consolidation of findings\",'Data extraction-synthesis'!L41)),\"X\",\"\")","v":""},{"$f":"IF(ISNUMBER(SEARCH(\"N/A\",'Data extraction-synthesis'!L41)),\"X\",\"\")","v":""}]
["PATH","Target Product Profile: Trachoma surveillance diagnostic-antigen lateral flow test",{"$f":"IF(ISNUMBER(SEARCH(\"Consensus/public meeting\",'Data extraction-synthesis'!L42)),\"X\",\"\")","v":""},{"$f":"IF(ISNUMBER(SEARCH(\"Meeting with experts/stakeholders\",'Data extraction-synthesis'!L42)),\"X\",\"\")","v":""},{"$f":"IF(ISNUMBER(SEARCH(\"Feedback from the consultation (e.g. survey, meeting, expert opinion) is incorporated into the final TPPs\",'Data extraction-synthesis'!L42)),\"X\",\"\")","v":""},{"$f":"IF(ISNUMBER(SEARCH(\"Mapping\",'Data extraction-synthesis'!L42)),\"X\",\"\")","v":""},{"$f":"IF(ISNUMBER(SEARCH(\"Market analyses\",'Data extraction-synthesis'!L42)),\"X\",\"\")","v":""},{"$f":"IF(ISNUMBER(SEARCH(\"Literature search\",'Data extraction-synthesis'!L42)),\"X\",\"\")","v":""},{"$f":"IF(ISNUMBER(SEARCH(\"Survey to retrieve input relevant for TPP\",'Data extraction-synthesis'!L42)),\"X\",\"\")","v":""},{"$f":"IF(ISNUMBER(SEARCH(\"Landscaping exercise\",'Data extraction-synthesis'!L42)),\"X\",\"\")","v":""},{"$f":"IF(ISNUMBER(SEARCH(\"Draft TPP\",'Data extraction-synthesis'!L42)),\"X\",\"\")","v":""},{"$f":"IF(ISNUMBER(SEARCH(\"Round of revisions of TPP\",'Data extraction-synthesis'!L42)),\"X\",\"\")","v":""},{"$f":"IF(ISNUMBER(SEARCH(\"Draft shortened TPP\",'Data extraction-synthesis'!L42)),\"X\",\"\")","v":""},{"$f":"IF(ISNUMBER(SEARCH(\"Presentation of shortened TPP to large stakeholder audience\",'Data extraction-synthesis'!L42)),\"X\",\"\")","v":""},{"$f":"IF(ISNUMBER(SEARCH(\"Identification of most important needs\",'Data extraction-synthesis'!L42)),\"X\",\"\")","v":""},{"$f":"IF(ISNUMBER(SEARCH(\"Prioritization exercise\",'Data extraction-synthesis'!L42)),\"X\",\"\")","v":""},{"$f":"IF(ISNUMBER(SEARCH(\"Delphi-like approach to gauge stakeholders’ agreement with the TPP\",'Data extraction-synthesis'!L42)),\"X\",\"\")","v":""},{"$f":"IF(ISNUMBER(SEARCH(\"Data analysis\",'Data extraction-synthesis'!L42)),\"X\",\"\")","v":""},{"$f":"IF(ISNUMBER(SEARCH(\"Definition problem statement/use case  \",'Data extraction-synthesis'!L42)),\"X\",\"\")","v":""},{"$f":"IF(ISNUMBER(SEARCH(\"Identification of stakeholders to involve in draft TPP \",'Data extraction-synthesis'!L42)),\"X\",\"\")","v":""},{"$f":"IF(ISNUMBER(SEARCH(\"Definition TPP domains \",'Data extraction-synthesis'!L42)),\"X\",\"\")","v":""},{"$f":"IF(ISNUMBER(SEARCH(\"Survey to measure stakeholder’s preferences and agreement \",'Data extraction-synthesis'!L42)),\"X\",\"\")","v":""},{"$f":"IF(ISNUMBER(SEARCH(\"Reviewing available literature and data\",'Data extraction-synthesis'!L42)),\"X\",\"\")","v":""},{"$f":"IF(ISNUMBER(SEARCH(\"Defining scope TPP \",'Data extraction-synthesis'!L42)),\"X\",\"\")","v":""},{"$f":"IF(ISNUMBER(SEARCH(\"Interview with stakeholders\",'Data extraction-synthesis'!L42)),\"X\",\"\")","v":""},{"$f":"IF(ISNUMBER(SEARCH(\"Field research \",'Data extraction-synthesis'!L42)),\"X\",\"\")","v":""},{"$f":"IF(ISNUMBER(SEARCH(\"Consolidation of findings\",'Data extraction-synthesis'!L42)),\"X\",\"\")","v":""},{"$f":"IF(ISNUMBER(SEARCH(\"N/A\",'Data extraction-synthesis'!L42)),\"X\",\"\")","v":"X"}]
["Peck, R. B. W., J. D.: Boettcher, M. G.: Downing","Defining product requirements for field deployable yellow fever tests",{"$f":"IF(ISNUMBER(SEARCH(\"Consensus/public meeting\",'Data extraction-synthesis'!L43)),\"X\",\"\")","v":""},{"$f":"IF(ISNUMBER(SEARCH(\"Meeting with experts/stakeholders\",'Data extraction-synthesis'!L43)),\"X\",\"\")","v":""},{"$f":"IF(ISNUMBER(SEARCH(\"Feedback from the consultation (e.g. survey, meeting, expert opinion) is incorporated into the final TPPs\",'Data extraction-synthesis'!L43)),\"X\",\"\")","v":""},{"$f":"IF(ISNUMBER(SEARCH(\"Mapping\",'Data extraction-synthesis'!L43)),\"X\",\"\")","v":""},{"$f":"IF(ISNUMBER(SEARCH(\"Market analyses\",'Data extraction-synthesis'!L43)),\"X\",\"\")","v":""},{"$f":"IF(ISNUMBER(SEARCH(\"Literature search\",'Data extraction-synthesis'!L43)),\"X\",\"\")","v":""},{"$f":"IF(ISNUMBER(SEARCH(\"Survey to retrieve input relevant for TPP\",'Data extraction-synthesis'!L43)),\"X\",\"\")","v":""},{"$f":"IF(ISNUMBER(SEARCH(\"Landscaping exercise\",'Data extraction-synthesis'!L43)),\"X\",\"\")","v":""},{"$f":"IF(ISNUMBER(SEARCH(\"Draft TPP\",'Data extraction-synthesis'!L43)),\"X\",\"\")","v":"X"},{"$f":"IF(ISNUMBER(SEARCH(\"Round of revisions of TPP\",'Data extraction-synthesis'!L43)),\"X\",\"\")","v":""},{"$f":"IF(ISNUMBER(SEARCH(\"Draft shortened TPP\",'Data extraction-synthesis'!L43)),\"X\",\"\")","v":""},{"$f":"IF(ISNUMBER(SEARCH(\"Presentation of shortened TPP to large stakeholder audience\",'Data extraction-synthesis'!L43)),\"X\",\"\")","v":""},{"$f":"IF(ISNUMBER(SEARCH(\"Identification of most important needs\",'Data extraction-synthesis'!L43)),\"X\",\"\")","v":""},{"$f":"IF(ISNUMBER(SEARCH(\"Prioritization exercise\",'Data extraction-synthesis'!L43)),\"X\",\"\")","v":""},{"$f":"IF(ISNUMBER(SEARCH(\"Delphi-like approach to gauge stakeholders’ agreement with the TPP\",'Data extraction-synthesis'!L43)),\"X\",\"\")","v":""},{"$f":"IF(ISNUMBER(SEARCH(\"Data analysis\",'Data extraction-synthesis'!L43)),\"X\",\"\")","v":""},{"$f":"IF(ISNUMBER(SEARCH(\"Definition problem statement/use case  \",'Data extraction-synthesis'!L43)),\"X\",\"\")","v":"X"},{"$f":"IF(ISNUMBER(SEARCH(\"Identification of stakeholders to involve in draft TPP \",'Data extraction-synthesis'!L43)),\"X\",\"\")","v":""},{"$f":"IF(ISNUMBER(SEARCH(\"Definition TPP domains \",'Data extraction-synthesis'!L43)),\"X\",\"\")","v":""},{"$f":"IF(ISNUMBER(SEARCH(\"Survey to measure stakeholder’s preferences and agreement \",'Data extraction-synthesis'!L43)),\"X\",\"\")","v":""},{"$f":"IF(ISNUMBER(SEARCH(\"Reviewing available literature and data\",'Data extraction-synthesis'!L43)),\"X\",\"\")","v":""},{"$f":"IF(ISNUMBER(SEARCH(\"Defining scope TPP \",'Data extraction-synthesis'!L43)),\"X\",\"\")","v":""},{"$f":"IF(ISNUMBER(SEARCH(\"Interview with stakeholders\",'Data extraction-synthesis'!L43)),\"X\",\"\")","v":""},{"$f":"IF(ISNUMBER(SEARCH(\"Field research \",'Data extraction-synthesis'!L43)),\"X\",\"\")","v":""},{"$f":"IF(ISNUMBER(SEARCH(\"Consolidation of findings\",'Data extraction-synthesis'!L43)),\"X\",\"\")","v":""},{"$f":"IF(ISNUMBER(SEARCH(\"N/A\",'Data extraction-synthesis'!L43)),\"X\",\"\")","v":""}]
["PATH","Target Product Profile: Schistosomiasis Surveillance Diagnostic - schistosoma genus-specific antibody lateral flow test post-elimination surveillance",{"$f":"IF(ISNUMBER(SEARCH(\"Consensus/public meeting\",'Data extraction-synthesis'!L44)),\"X\",\"\")","v":""},{"$f":"IF(ISNUMBER(SEARCH(\"Meeting with experts/stakeholders\",'Data extraction-synthesis'!L44)),\"X\",\"\")","v":""},{"$f":"IF(ISNUMBER(SEARCH(\"Feedback from the consultation (e.g. survey, meeting, expert opinion) is incorporated into the final TPPs\",'Data extraction-synthesis'!L44)),\"X\",\"\")","v":""},{"$f":"IF(ISNUMBER(SEARCH(\"Mapping\",'Data extraction-synthesis'!L44)),\"X\",\"\")","v":""},{"$f":"IF(ISNUMBER(SEARCH(\"Market analyses\",'Data extraction-synthesis'!L44)),\"X\",\"\")","v":""},{"$f":"IF(ISNUMBER(SEARCH(\"Literature search\",'Data extraction-synthesis'!L44)),\"X\",\"\")","v":""},{"$f":"IF(ISNUMBER(SEARCH(\"Survey to retrieve input relevant for TPP\",'Data extraction-synthesis'!L44)),\"X\",\"\")","v":""},{"$f":"IF(ISNUMBER(SEARCH(\"Landscaping exercise\",'Data extraction-synthesis'!L44)),\"X\",\"\")","v":""},{"$f":"IF(ISNUMBER(SEARCH(\"Draft TPP\",'Data extraction-synthesis'!L44)),\"X\",\"\")","v":""},{"$f":"IF(ISNUMBER(SEARCH(\"Round of revisions of TPP\",'Data extraction-synthesis'!L44)),\"X\",\"\")","v":""},{"$f":"IF(ISNUMBER(SEARCH(\"Draft shortened TPP\",'Data extraction-synthesis'!L44)),\"X\",\"\")","v":""},{"$f":"IF(ISNUMBER(SEARCH(\"Presentation of shortened TPP to large stakeholder audience\",'Data extraction-synthesis'!L44)),\"X\",\"\")","v":""},{"$f":"IF(ISNUMBER(SEARCH(\"Identification of most important needs\",'Data extraction-synthesis'!L44)),\"X\",\"\")","v":""},{"$f":"IF(ISNUMBER(SEARCH(\"Prioritization exercise\",'Data extraction-synthesis'!L44)),\"X\",\"\")","v":""},{"$f":"IF(ISNUMBER(SEARCH(\"Delphi-like approach to gauge stakeholders’ agreement with the TPP\",'Data extraction-synthesis'!L44)),\"X\",\"\")","v":""},{"$f":"IF(ISNUMBER(SEARCH(\"Data analysis\",'Data extraction-synthesis'!L44)),\"X\",\"\")","v":""},{"$f":"IF(ISNUMBER(SEARCH(\"Definition problem statement/use case  \",'Data extraction-synthesis'!L44)),\"X\",\"\")","v":""},{"$f":"IF(ISNUMBER(SEARCH(\"Identification of stakeholders to involve in draft TPP \",'Data extraction-synthesis'!L44)),\"X\",\"\")","v":""},{"$f":"IF(ISNUMBER(SEARCH(\"Definition TPP domains \",'Data extraction-synthesis'!L44)),\"X\",\"\")","v":""},{"$f":"IF(ISNUMBER(SEARCH(\"Survey to measure stakeholder’s preferences and agreement \",'Data extraction-synthesis'!L44)),\"X\",\"\")","v":""},{"$f":"IF(ISNUMBER(SEARCH(\"Reviewing available literature and data\",'Data extraction-synthesis'!L44)),\"X\",\"\")","v":""},{"$f":"IF(ISNUMBER(SEARCH(\"Defining scope TPP \",'Data extraction-synthesis'!L44)),\"X\",\"\")","v":""},{"$f":"IF(ISNUMBER(SEARCH(\"Interview with stakeholders\",'Data extraction-synthesis'!L44)),\"X\",\"\")","v":""},{"$f":"IF(ISNUMBER(SEARCH(\"Field research \",'Data extraction-synthesis'!L44)),\"X\",\"\")","v":""},{"$f":"IF(ISNUMBER(SEARCH(\"Consolidation of findings\",'Data extraction-synthesis'!L44)),\"X\",\"\")","v":""},{"$f":"IF(ISNUMBER(SEARCH(\"N/A\",'Data extraction-synthesis'!L44)),\"X\",\"\")","v":"X"}]
["WHO, FIND, Medecins sans Frontiers","A Multiplex Multi-Analyte Diagnostic Platform",{"$f":"IF(ISNUMBER(SEARCH(\"Consensus/public meeting\",'Data extraction-synthesis'!L45)),\"X\",\"\")","v":"X"},{"$f":"IF(ISNUMBER(SEARCH(\"Meeting with experts/stakeholders\",'Data extraction-synthesis'!L45)),\"X\",\"\")","v":""},{"$f":"IF(ISNUMBER(SEARCH(\"Feedback from the consultation (e.g. survey, meeting, expert opinion) is incorporated into the final TPPs\",'Data extraction-synthesis'!L45)),\"X\",\"\")","v":"X"},{"$f":"IF(ISNUMBER(SEARCH(\"Mapping\",'Data extraction-synthesis'!L45)),\"X\",\"\")","v":""},{"$f":"IF(ISNUMBER(SEARCH(\"Market analyses\",'Data extraction-synthesis'!L45)),\"X\",\"\")","v":""},{"$f":"IF(ISNUMBER(SEARCH(\"Literature search\",'Data extraction-synthesis'!L45)),\"X\",\"\")","v":""},{"$f":"IF(ISNUMBER(SEARCH(\"Survey to retrieve input relevant for TPP\",'Data extraction-synthesis'!L45)),\"X\",\"\")","v":""},{"$f":"IF(ISNUMBER(SEARCH(\"Landscaping exercise\",'Data extraction-synthesis'!L45)),\"X\",\"\")","v":""},{"$f":"IF(ISNUMBER(SEARCH(\"Draft TPP\",'Data extraction-synthesis'!L45)),\"X\",\"\")","v":"X"},{"$f":"IF(ISNUMBER(SEARCH(\"Round of revisions of TPP\",'Data extraction-synthesis'!L45)),\"X\",\"\")","v":""},{"$f":"IF(ISNUMBER(SEARCH(\"Draft shortened TPP\",'Data extraction-synthesis'!L45)),\"X\",\"\")","v":""},{"$f":"IF(ISNUMBER(SEARCH(\"Presentation of shortened TPP to large stakeholder audience\",'Data extraction-synthesis'!L45)),\"X\",\"\")","v":""},{"$f":"IF(ISNUMBER(SEARCH(\"Identification of most important needs\",'Data extraction-synthesis'!L45)),\"X\",\"\")","v":""},{"$f":"IF(ISNUMBER(SEARCH(\"Prioritization exercise\",'Data extraction-synthesis'!L45)),\"X\",\"\")","v":""},{"$f":"IF(ISNUMBER(SEARCH(\"Delphi-like approach to gauge stakeholders’ agreement with the TPP\",'Data extraction-synthesis'!L45)),\"X\",\"\")","v":"X"},{"$f":"IF(ISNUMBER(SEARCH(\"Data analysis\",'Data extraction-synthesis'!L45)),\"X\",\"\")","v":""},{"$f":"IF(ISNUMBER(SEARCH(\"Definition problem statement/use case  \",'Data extraction-synthesis'!L45)),\"X\",\"\")","v":""},{"$f":"IF(ISNUMBER(SEARCH(\"Identification of stakeholders to involve in draft TPP \",'Data extraction-synthesis'!L45)),\"X\",\"\")","v":""},{"$f":"IF(ISNUMBER(SEARCH(\"Definition TPP domains \",'Data extraction-synthesis'!L45)),\"X\",\"\")","v":""},{"$f":"IF(ISNUMBER(SEARCH(\"Survey to measure stakeholder’s preferences and agreement \",'Data extraction-synthesis'!L45)),\"X\",\"\")","v":""},{"$f":"IF(ISNUMBER(SEARCH(\"Reviewing available literature and data\",'Data extraction-synthesis'!L45)),\"X\",\"\")","v":""},{"$f":"IF(ISNUMBER(SEARCH(\"Defining scope TPP \",'Data extraction-synthesis'!L45)),\"X\",\"\")","v":""},{"$f":"IF(ISNUMBER(SEARCH(\"Interview with stakeholders\",'Data extraction-synthesis'!L45)),\"X\",\"\")","v":"X"},{"$f":"IF(ISNUMBER(SEARCH(\"Field research \",'Data extraction-synthesis'!L45)),\"X\",\"\")","v":""},{"$f":"IF(ISNUMBER(SEARCH(\"Consolidation of findings\",'Data extraction-synthesis'!L45)),\"X\",\"\")","v":""},{"$f":"IF(ISNUMBER(SEARCH(\"N/A\",'Data extraction-synthesis'!L45)),\"X\",\"\")","v":""}]
[null,"TOT",{"$f":"COUNTIF(C3:C46,\"X\")","v":12},{"$f":"COUNTIF(D3:D46,\"X\")","v":6},11,1,0,0,3,5,29,11,5,2,3,5,10,0,10,1,1,5,3,2,{"$f":"COUNTIF(Y3:Y46,\"X\")","v":1},{"$f":"COUNTIF(Z3:Z46,\"X\")","v":0},{"$f":"COUNTIF(AA3:AA46,\"X\")","v":2},{"$f":"COUNTIF(AB3:AB46,\"X\")","v":14}]
[null,null,{"$f":"C47/44","v":{"v":0.2727272727272727,"d":"27%"}},{"$f":"D47/44","v":{"v":0.13636363636363635,"d":"14%"}},{"v":0.25,"d":"25%"},{"v":0.022727272727272728,"d":"2%"},{"v":0,"d":"0%"},{"v":0,"d":"0%"},{"v":0.06818181818181818,"d":"7%"},{"v":0.11363636363636363,"d":"11%"},{"v":0.6590909090909091,"d":"66%"},{"v":0.25,"d":"25%"},{"v":0.11363636363636363,"d":"11%"},{"v":0.045454545454545456,"d":"5%"},{"v":0.06818181818181818,"d":"7%"},{"v":0.11363636363636363,"d":"11%"},{"v":0.22727272727272727,"d":"23%"},{"v":0,"d":"0%"},{"v":0.22727272727272727,"d":"23%"},{"v":0.022727272727272728,"d":"2%"},{"v":0.022727272727272728,"d":"2%"},{"v":0.11363636363636363,"d":"11%"},{"v":0.06818181818181818,"d":"7%"},{"v":0.045454545454545456,"d":"5%"},{"$f":"Y47/44","v":{"v":0.022727272727272728,"d":"2%"}},{"$f":"Z47/44","v":{"v":0,"d":"0%"}},{"$f":"AA47/44","v":{"v":0.045454545454545456,"d":"5%"}},{"$f":"AB47/44","v":{"v":0.3181818181818182,"d":"32%"}}]

{"sheet":"Stakeholders involved","index":6,"n_rows":60,"n_cols":87,"rows_kept":60,"merged":[[0,2,0,80],[51,5,52,24]]}
[null,null,"STAKEHOLDERS INVOLVED TO DEVELOP A TPP"]
["Authors ","Article title","Industry (unspecific)","Phase","Industry representatives","Phase 1","Phase 2","Phase 3","Test developers","Phase","Academia/researchers","Phase 1","Phase 2","Phase 3","Clinicians","Phase 1","Phase 2","Phase 3","Representatives of countries and national disease programs","Phase 1","Phase 2","Phase 3","International/public health institution (e.g. WHO) ","Phase 1","Phase 2","Phase 3","Experts (unspecific)","Phase 1","Phase 2","Laboratory experts","Phase 1","Phase 2","Non-profit sector","Phase 1","Phase 2","Technical/funding agencies ","Phase 1","Phase 2","Phase 3","Policy makers","Phase 1","Phase 2","Phase 3","Implementers","Phase 1","Phase 2","Phase 3","Patient/community advocates","Phase 1","Phase 2","Phase 3","Microbiologists","Phase 1","Phase 2","Phase 3","Modelers","Phase 1","Phase 2","Health economists","Phase 1","Phase 2","Donors","Phase 1","Phase 2","Market experts","Phase 1","Phase 2","Phase 3"," Program manager","Phase 1","Phase 2","Scientific associations","Phase 1 ","Phase 2","Phase 3","Strategists","Phase 1","Phase 2","Other","Phase 1","Phase 2"]
["Chua, A. P., I.: Nuebling, C. M.: Wood, D.: Moussy, F.","Update on Zika Diagnostic Tests and WHO's Related Activities",{"$f":"IF(ISNUMBER(SEARCH(\"Industry (unspecific)\",'Data extraction-synthesis'!M2)),\"X\",\"\")","v":""},null,{"$f":"IF(OR(C3=\"X\",I3=\"X\"),\"X\",\"\")","v":""},{"$nulls":3},{"$f":"IF(ISNUMBER(SEARCH(\"Test developers\",'Data extraction-synthesis'!M2)),\"X\",\"\")","v":""},null,{"$f":"IF(ISNUMBER(SEARCH(\"Academia/researchers\",'Data extraction-synthesis'!M2)),\"X\",\"\")","v":"X"},"Drafting",null,null,{"$f":"IF(ISNUMBER(SEARCH(\"Clinicians\",'Data extraction-synthesis'!M2)),\"X\",\"\")","v":""},{"$nulls":3},{"$f":"IF(ISNUMBER(SEARCH(\"Representatives of countries and national disease programs\",'Data extraction-synthesis'!M2)),\"X\",\"\")","v":""},{"$nulls":3},{"$f":"IF(ISNUMBER(SEARCH(\"International/public health institution \",'Data extraction-synthesis'!M2)),\"X\",\"\")","v":"X"},"Drafting",null,null,{"$f":"IF(ISNUMBER(SEARCH(\"Experts (unspecific)\",'Data extraction-synthesis'!M2)),\"X\",\"\")","v":""},null,null,{"$f":"IF(ISNUMBER(SEARCH(\"Laboratory experts\",'Data extraction-synthesis'!M2)),\"X\",\"\")","v":""},null,null,{"$f":"IF(ISNUMBER(SEARCH(\"Non-profit sector\",'Data extraction-synthesis'!M2)),\"X\",\"\")","v":""},null,null,{"$f":"IF(ISNUMBER(SEARCH(\"Technical/funding agencies\",'Data extraction-synthesis'!M2)),\"X\",\"\")","v":""},{"$nulls":3},{"$f":"IF(ISNUMBER(SEARCH(\"Policy makers\",'Data extraction-synthesis'!M2)),\"X\",\"\")","v":""},{"$nulls":3},{"$f":"IF(ISNUMBER(SEARCH(\"Implementers\",'Data extraction-synthesis'!M2)),\"X\",\"\")","v":""},{"$nulls":3},{"$f":"IF(ISNUMBER(SEARCH(\"Patient/community advocates\",'Data extraction-synthesis'!M2)),\"X\",\"\")","v":""},{"$nulls":3},{"$f":"IF(ISNUMBER(SEARCH(\"Microbiologists\",'Data extraction-synthesis'!M2)),\"X\",\"\")","v":""},{"$nulls":3},{"$f":"IF(ISNUMBER(SEARCH(\"Modelers\",'Data extraction-synthesis'!M2)),\"X\",\"\")","v":""},null,null,{"$f":"IF(ISNUMBER(SEARCH(\"Health economists\",'Data extraction-synthesis'!M2)),\"X\",\"\")","v":""},{"$f":"IF(ISNUMBER(SEARCH(\"Health economists\",'Data extraction-synthesis'!#REF!)),\"X\",\"\")","v":""},null,{"$f":"IF(ISNUMBER(SEARCH(\"Donors\",'Data extraction-synthesis'!M2)),\"X\",\"\")","v":""},null,null,{"$f":"IF(ISNUMBER(SEARCH(\"Market experts\",'Data extraction-synthesis'!M2)),\"X\",\"\")","v":""},{"$nulls":3},{"$f":"IF(ISNUMBER(SEARCH(\"Program manager\",'Data extraction-synthesis'!M2)),\"X\",\"\")","v":""},null,null,{"$f":"IF(ISNUMBER(SEARCH(\"Scientific associations\",'Data extraction-synthesis'!M2)),\"X\",\"\")","v":"X"},"Drafting",null,null,{"$f":"IF(ISNUMBER(SEARCH(\"Strategists\",'Data extraction-synthesis'!M2)),\"X\",\"\")","v":""},null,null,{"$f":"IF(ISNUMBER(SEARCH(\"Other\",'Data extraction-synthesis'!M2)),\"X\",\"\")","v":""},{"$nulls":7},"Drafting"]
["Denkinger, C. M. D., D.: Schito, M.: Wells, W.: Cobelens, F.: Pai, M.: Zignol, M.: Cirillo, D. M.: Alland, D.: Casenghi, M.: Gallarda, J.: Boehme, C. C.: Perkins, M. D","Target Product Profile of a Molecular Drug-Susceptibility Test for Use in Microscopy Centers",{"$f":"IF(ISNUMBER(SEARCH(\"Industry (unspecific)\",'Data extraction-synthesis'!M3)),\"X\",\"\")","v":""},1,"X","Scoping",null,null,{"$f":"IF(ISNUMBER(SEARCH(\"Test developers\",'Data extraction-synthesis'!M3)),\"X\",\"\")","v":"X"},null,{"$f":"IF(ISNUMBER(SEARCH(\"Academia/researchers\",'Data extraction-synthesis'!M3)),\"X\",\"\")","v":"X"},"Scoping",null,null,{"$f":"IF(ISNUMBER(SEARCH(\"Clinicians\",'Data extraction-synthesis'!M3)),\"X\",\"\")","v":"X"},"Scoping","Consensus-building","Drafting",{"$f":"IF(ISNUMBER(SEARCH(\"Representatives of countries and national disease programs\",'Data extraction-synthesis'!M3)),\"X\",\"\")","v":"X"},"Consensus-building",null,null,{"$f":"IF(ISNUMBER(SEARCH(\"International/public health institution \",'Data extraction-synthesis'!M3)),\"X\",\"\")","v":""},{"$nulls":3},{"$f":"IF(ISNUMBER(SEARCH(\"Experts (unspecific)\",'Data extraction-synthesis'!M3)),\"X\",\"\")","v":""},null,null,{"$f":"IF(ISNUMBER(SEARCH(\"Laboratory experts\",'Data extraction-synthesis'!M3)),\"X\",\"\")","v":"X"},"Scoping","Drafting",{"$f":"IF(ISNUMBER(SEARCH(\"Non-profit sector\",'Data extraction-synthesis'!M3)),\"X\",\"\")","v":""},null,null,{"$f":"IF(ISNUMBER(SEARCH(\"Technical/funding agencies\",'Data extraction-synthesis'!M3)),\"X\",\"\")","v":""},{"$nulls":3},{"$f":"IF(ISNUMBER(SEARCH(\"Policy makers\",'Data extraction-synthesis'!M3)),\"X\",\"\")","v":"X"},"Consensus-building",null,null,{"$f":"IF(ISNUMBER(SEARCH(\"Implementers\",'Data extraction-synthesis'!M3)),\"X\",\"\")","v":"X"},"Consensus-building",null,null,{"$f":"IF(ISNUMBER(SEARCH(\"Patient/community advocates\",'Data extraction-synthesis'!M3)),\"X\",\"\")","v":""},{"$nulls":3},{"$f":"IF(ISNUMBER(SEARCH(\"Microbiologists\",'Data extraction-synthesis'!M3)),\"X\",\"\")","v":""},{"$nulls":3},{"$f":"IF(ISNUMBER(SEARCH(\"Modelers\",'Data extraction-synthesis'!M3)),\"X\",\"\")","v":""},null,null,{"$f":"IF(ISNUMBER(SEARCH(\"Health economists\",'Data extraction-synthesis'!M3)),\"X\",\"\")","v":""},null,null,{"$f":"IF(ISNUMBER(SEARCH(\"Donors\",'Data extraction-synthesis'!M3)),\"X\",\"\")","v":""},null,null,{"$f":"IF(ISNUMBER(SEARCH(\"Market experts\",'Data extraction-synthesis'!M3)),\"X\",\"\")","v":""},{"$nulls":3},{"$f":"IF(ISNUMBER(SEARCH(\"Program manager\",'Data extraction-synthesis'!M3)),\"X\",\"\")","v":""},null,null,{"$f":"IF(ISNUMBER(SEARCH(\"Scientific associations\",'Data extraction-synthesis'!M3)),\"X\",\"\")","v":""},{"$nulls":3},{"$f":"IF(ISNUMBER(SEARCH(\"Strategists\",'Data extraction-synthesis'!M3)),\"X\",\"\")","v":""},null,null,{"$f":"IF(ISNUMBER(SEARCH(\"Other\",'Data extraction-synthesis'!M3)),\"X\",\"\")","v":""},{"$nulls":7},"Scoping"]
["Denkinger, C. M. K., Sandra V.: Cirillo, Daniela Maria: Casenghi, Martina: Shinnick, Thomas: Weyer, Karin: Gilpin, Chris: Boehme, Catharina C.: Schito, Marco: Kimerling, Michael: Pai, Madhuka","Defining the needs for next generation assays for tuberculosis",{"$f":"IF(ISNUMBER(SEARCH(\"Industry (unspecific)\",'Data extraction-synthesis'!M4)),\"X\",\"\")","v":""},null,"X","Drafting","Consensus-building",null,{"$f":"IF(ISNUMBER(SEARCH(\"Test developers\",'Data extraction-synthesis'!M4)),\"X\",\"\")","v":"X"},null,{"$f":"IF(ISNUMBER(SEARCH(\"Academia/researchers\",'Data extraction-synthesis'!M4)),\"X\",\"\")","v":"X"},"Scoping","Drafting",null,{"$f":"IF(ISNUMBER(SEARCH(\"Clinicians\",'Data extraction-synthesis'!M4)),\"X\",\"\")","v":"X"},"Scoping","Drafting","Consensus-building",{"$f":"IF(ISNUMBER(SEARCH(\"Representatives of countries and national disease programs\",'Data extraction-synthesis'!M4)),\"X\",\"\")","v":"X"},"Scoping","Consensus-building",null,{"$f":"IF(ISNUMBER(SEARCH(\"International/public health institution \",'Data extraction-synthesis'!M4)),\"X\",\"\")","v":""},{"$nulls":3},{"$f":"IF(ISNUMBER(SEARCH(\"Experts (unspecific)\",'Data extraction-synthesis'!M4)),\"X\",\"\")","v":""},null,null,{"$f":"IF(ISNUMBER(SEARCH(\"Laboratory experts\",'Data extraction-synthesis'!M4)),\"X\",\"\")","v":"X"},"Scoping",null,{"$f":"IF(ISNUMBER(SEARCH(\"Non-profit sector\",'Data extraction-synthesis'!M4)),\"X\",\"\")","v":""},null,null,{"$f":"IF(ISNUMBER(SEARCH(\"Technical/funding agencies\",'Data extraction-synthesis'!M4)),\"X\",\"\")","v":"X"},"Drafting",null,null,{"$f":"IF(ISNUMBER(SEARCH(\"Policy makers\",'Data extraction-synthesis'!M4)),\"X\",\"\")","v":"X"},"Drafting",null,null,{"$f":"IF(ISNUMBER(SEARCH(\"Implementers\",'Data extraction-synthesis'!M4)),\"X\",\"\")","v":""},{"$nulls":3},{"$f":"IF(ISNUMBER(SEARCH(\"Patient/community advocates\",'Data extraction-synthesis'!M4)),\"X\",\"\")","v":"X"},"Scoping",null,null,{"$f":"IF(ISNUMBER(SEARCH(\"Microbiologists\",'Data extraction-synthesis'!M4)),\"X\",\"\")","v":""},{"$nulls":3},{"$f":"IF(ISNUMBER(SEARCH(\"Modelers\",'Data extraction-synthesis'!M4)),\"X\",\"\")","v":"X"},"Scoping",null,{"$f":"IF(ISNUMBER(SEARCH(\"Health economists\",'Data extraction-synthesis'!M4)),\"X\",\"\")","v":""},null,null,{"$f":"IF(ISNUMBER(SEARCH(\"Donors\",'Data extraction-synthesis'!M4)),\"X\",\"\")","v":""},null,null,{"$f":"IF(ISNUMBER(SEARCH(\"Market experts\",'Data extraction-synthesis'!M4)),\"X\",\"\")","v":"X"},"Scoping",null,null,{"$f":"IF(ISNUMBER(SEARCH(\"Program manager\",'Data extraction-synthesis'!M4)),\"X\",\"\")","v":""},null,null,{"$f":"IF(ISNUMBER(SEARCH(\"Scientific associations\",'Data extraction-synthesis'!M4)),\"X\",\"\")","v":""},{"$nulls":3},{"$f":"IF(ISNUMBER(SEARCH(\"Strategists\",'Data extraction-synthesis'!M4)),\"X\",\"\")","v":""},null,null,{"$f":"IF(ISNUMBER(SEARCH(\"Other\",'Data extraction-synthesis'!M4)),\"X\",\"\")","v":""},{"$nulls":7},"Consensus-building"]
["DIAMETER Project, PATH","Point-of-Care Malaria Infection Detection Test For rapid detection of low-density, subclinical malaria infections",{"$f":"IF(ISNUMBER(SEARCH(\"Industry (unspecific)\",'Data extraction-synthesis'!M5)),\"X\",\"\")","v":""},null,"",{"$nulls":3},{"$f":"IF(ISNUMBER(SEARCH(\"Test developers\",'Data extraction-synthesis'!M5)),\"X\",\"\")","v":""},null,{"$f":"IF(ISNUMBER(SEARCH(\"Academia/researchers\",'Data extraction-synthesis'!M5)),\"X\",\"\")","v":""},{"$nulls":3},{"$f":"IF(ISNUMBER(SEARCH(\"Clinicians\",'Data extraction-synthesis'!M5)),\"X\",\"\")","v":""},{"$nulls":3},{"$f":"IF(ISNUMBER(SEARCH(\"Representatives of countries and national disease programs\",'Data extraction-synthesis'!M5)),\"X\",\"\")","v":""},{"$nulls":3},{"$f":"IF(ISNUMBER(SEARCH(\"International/public health institution \",'Data extraction-synthesis'!M5)),\"X\",\"\")","v":""},{"$nulls":3},{"$f":"IF(ISNUMBER(SEARCH(\"Experts (unspecific)\",'Data extraction-synthesis'!M5)),\"X\",\"\")","v":""},null,null,{"$f":"IF(ISNUMBER(SEARCH(\"Laboratory experts\",'Data extraction-synthesis'!M5)),\"X\",\"\")","v":""},null,null,{"$f":"IF(ISNUMBER(SEARCH(\"Non-profit sector\",'Data extraction-synthesis'!M5)),\"X\",\"\")","v":""},null,null,{"$f":"IF(ISNUMBER(SEARCH(\"Technical/funding agencies\",'Data extraction-synthesis'!M5)),\"X\",\"\")","v":""},{"$nulls":3},{"$f":"IF(ISNUMBER(SEARCH(\"Policy makers\",'Data extraction-synthesis'!M5)),\"X\",\"\")","v":""},{"$nulls":3},{"$f":"IF(ISNUMBER(SEARCH(\"Implementers\",'Data extraction-synthesis'!M5)),\"X\",\"\")","v":""},{"$nulls":3},{"$f":"IF(ISNUMBER(SEARCH(\"Patient/community advocates\",'Data extraction-synthesis'!M5)),\"X\",\"\")","v":""},{"$nulls":3},{"$f":"IF(ISNUMBER(SEARCH(\"Microbiologists\",'Data extraction-synthesis'!M5)),\"X\",\"\")","v":""},{"$nulls":3},{"$f":"IF(ISNUMBER(SEARCH(\"Modelers\",'Data extraction-synthesis'!M5)),\"X\",\"\")","v":""},null,null,{"$f":"IF(ISNUMBER(SEARCH(\"Health economists\",'Data extraction-synthesis'!M5)),\"X\",\"\")","v":""},null,null,{"$f":"IF(ISNUMBER(SEARCH(\"Donors\",'Data extraction-synthesis'!M5)),\"X\",\"\")","v":""},null,null,{"$f":"IF(ISNUMBER(SEARCH(\"Market experts\",'Data extraction-synthesis'!M5)),\"X\",\"\")","v":""},{"$nulls":3},{"$f":"IF(ISNUMBER(SEARCH(\"Program manager\",'Data extraction-synthesis'!M5)),\"X\",\"\")","v":""},null,null,{"$f":"IF(ISNUMBER(SEARCH(\"Scientific associations\",'Data extraction-synthesis'!M5)),\"X\",\"\")","v":""},{"$nulls":3},{"$f":"IF(ISNUMBER(SEARCH(\"Strategists\",'Data extraction-synthesis'!M5)),\"X\",\"\")","v":""},null,null,{"$f":"IF(ISNUMBER(SEARCH(\"Other\",'Data extraction-synthesis'!M5)),\"X\",\"\")","v":""}]
["Ding, X. C. A., Maria Paz: Baird, J. Kevin: Cheng, Qin: Cunningham, Jane: Dhorda, Mehul: Drakeley, Chris: Felger, Ingrid: Gamboa, Dionicia: Harbers, Matthias: Herrera, Socrates: Lucchi, Naomi: Mayor, Alfredo: Mueller, Ivo: Sattabongkot, Jetsumon: Ratsimbason, Arsène: Richards, Jack: Tanner, Marcel: González, Iveth J.","Defining the next generation of Plasmodium vivax diagnostic tests for control and elimination: Target product profiles",{"$f":"IF(ISNUMBER(SEARCH(\"Industry (unspecific)\",'Data extraction-synthesis'!M6)),\"X\",\"\")","v":""},null,"",{"$nulls":3},{"$f":"IF(ISNUMBER(SEARCH(\"Test developers\",'Data extraction-synthesis'!M6)),\"X\",\"\")","v":""},null,{"$f":"IF(ISNUMBER(SEARCH(\"Academia/researchers\",'Data extraction-synthesis'!M6)),\"X\",\"\")","v":"X"},"Consensus-building","Scoping",null,{"$f":"IF(ISNUMBER(SEARCH(\"Clinicians\",'Data extraction-synthesis'!M6)),\"X\",\"\")","v":""},{"$nulls":3},{"$f":"IF(ISNUMBER(SEARCH(\"Representatives of countries and national disease programs\",'Data extraction-synthesis'!M6)),\"X\",\"\")","v":"X"},"Consensus-building","Scoping",null,{"$f":"IF(ISNUMBER(SEARCH(\"International/public health institution \",'Data extraction-synthesis'!M6)),\"X\",\"\")","v":"X"},"Consensus-building","Scoping",null,{"$f":"IF(ISNUMBER(SEARCH(\"Experts (unspecific)\",'Data extraction-synthesis'!M6)),\"X\",\"\")","v":""},null,null,{"$f":"IF(ISNUMBER(SEARCH(\"Laboratory experts\",'Data extraction-synthesis'!M6)),\"X\",\"\")","v":""},null,null,{"$f":"IF(ISNUMBER(SEARCH(\"Non-profit sector\",'Data extraction-synthesis'!M6)),\"X\",\"\")","v":""},null,null,{"$f":"IF(ISNUMBER(SEARCH(\"Technical/funding agencies\",'Data extraction-synthesis'!M6)),\"X\",\"\")","v":""},{"$nulls":3},{"$f":"IF(ISNUMBER(SEARCH(\"Policy makers\",'Data extraction-synthesis'!M6)),\"X\",\"\")","v":""},{"$nulls":3},{"$f":"IF(ISNUMBER(SEARCH(\"Implementers\",'Data extraction-synthesis'!M6)),\"X\",\"\")","v":""},{"$nulls":3},{"$f":"IF(ISNUMBER(SEARCH(\"Patient/community advocates\",'Data extraction-synthesis'!M6)),\"X\",\"\")","v":""},{"$nulls":3},{"$f":"IF(ISNUMBER(SEARCH(\"Microbiologists\",'Data extraction-synthesis'!M6)),\"X\",\"\")","v":""},{"$nulls":3},{"$f":"IF(ISNUMBER(SEARCH(\"Modelers\",'Data extraction-synthesis'!M6)),\"X\",\"\")","v":""},null,null,{"$f":"IF(ISNUMBER(SEARCH(\"Health economists\",'Data extraction-synthesis'!M6)),\"X\",\"\")","v":""},null,null,{"$f":"IF(ISNUMBER(SEARCH(\"Donors\",'Data extraction-synthesis'!M6)),\"X\",\"\")","v":""},null,null,{"$f":"IF(ISNUMBER(SEARCH(\"Market experts\",'Data extraction-synthesis'!M6)),\"X\",\"\")","v":""},{"$nulls":3},{"$f":"IF(ISNUMBER(SEARCH(\"Program manager\",'Data extraction-synthesis'!M6)),\"X\",\"\")","v":""},null,null,{"$f":"IF(ISNUMBER(SEARCH(\"Scientific associations\",'Data extraction-synthesis'!M6)),\"X\",\"\")","v":""},{"$nulls":3},{"$f":"IF(ISNUMBER(SEARCH(\"Strategists\",'Data extraction-synthesis'!M6)),\"X\",\"\")","v":""},null,null,{"$f":"IF(ISNUMBER(SEARCH(\"Other\",'Data extraction-synthesis'!M6)),\"X\",\"\")","v":""}]
["Dittrich, S. T., B. T.: Moussy, F.: Chua, A.: Zorzet, A.: Tangden, T.: Dolinger, D. L.: Page, A. L.: Crump, J. A.: Valerie, D.: Bassat, Q.: Lubell, Y.: Heinrich, N.: Newton, P. N.: Rodwell, T.: Gonzalez, I. J.","Target Product Profile for a Diagnostic Assay to Differentiate between Bacterial and Non-Bacterial Infections to Guide Antimicrobials Use in Resource-Limited Settings: An Expert Consensus",{"$f":"IF(ISNUMBER(SEARCH(\"Industry (unspecific)\",'Data extraction-synthesis'!M7)),\"X\",\"\")","v":""},null,"X","Drafting","Consensus-building",null,{"$f":"IF(ISNUMBER(SEARCH(\"Test developers\",'Data extraction-synthesis'!M7)),\"X\",\"\")","v":"X"},null,{"$f":"IF(ISNUMBER(SEARCH(\"Academia/researchers\",'Data extraction-synthesis'!M7)),\"X\",\"\")","v":"X"},"Drafting","Consensus-building",null,{"$f":"IF(ISNUMBER(SEARCH(\"Clinicians\",'Data extraction-synthesis'!M7)),\"X\",\"\")","v":""},{"$nulls":3},{"$f":"IF(ISNUMBER(SEARCH(\"Representatives of countries and national disease programs\",'Data extraction-synthesis'!M7)),\"X\",\"\")","v":""},{"$nulls":3},{"$f":"IF(ISNUMBER(SEARCH(\"International/public health institution \",'Data extraction-synthesis'!M7)),\"X\",\"\")","v":"X"},"Drafting","Consensus-building",null,{"$f":"IF(ISNUMBER(SEARCH(\"Experts (unspecific)\",'Data extraction-synthesis'!M7)),\"X\",\"\")","v":""},null,null,{"$f":"IF(ISNUMBER(SEARCH(\"Laboratory experts\",'Data extraction-synthesis'!M7)),\"X\",\"\")","v":"X"},"Drafting","Consensus-building",{"$f":"IF(ISNUMBER(SEARCH(\"Non-profit sector\",'Data extraction-synthesis'!M7)),\"X\",\"\")","v":""},null,null,{"$f":"IF(ISNUMBER(SEARCH(\"Technical/funding agencies\",'Data extraction-synthesis'!M7)),\"X\",\"\")","v":""},{"$nulls":3},{"$f":"IF(ISNUMBER(SEARCH(\"Policy makers\",'Data extraction-synthesis'!M7)),\"X\",\"\")","v":""},{"$nulls":3},{"$f":"IF(ISNUMBER(SEARCH(\"Implementers\",'Data extraction-synthesis'!M7)),\"X\",\"\")","v":""},{"$nulls":3},{"$f":"IF(ISNUMBER(SEARCH(\"Patient/community advocates\",'Data extraction-synthesis'!M7)),\"X\",\"\")","v":""},{"$nulls":3},{"$f":"IF(ISNUMBER(SEARCH(\"Microbiologists\",'Data extraction-synthesis'!M7)),\"X\",\"\")","v":"X"},"Drafting",null,"Consensus-building",{"$f":"IF(ISNUMBER(SEARCH(\"Modelers\",'Data extraction-synthesis'!M7)),\"X\",\"\")","v":""},null,null,{"$f":"IF(ISNUMBER(SEARCH(\"Health economists\",'Data extraction-synthesis'!M7)),\"X\",\"\")","v":"X"},"Drafting","Consensus-building",{"$f":"IF(ISNUMBER(SEARCH(\"Donors\",'Data extraction-synthesis'!M7)),\"X\",\"\")","v":""},null,null,{"$f":"IF(ISNUMBER(SEARCH(\"Market experts\",'Data extraction-synthesis'!M7)),\"X\",\"\")","v":""},{"$nulls":3},{"$f":"IF(ISNUMBER(SEARCH(\"Program manager\",'Data extraction-synthesis'!M7)),\"X\",\"\")","v":""},null,null,{"$f":"IF(ISNUMBER(SEARCH(\"Scientific associations\",'Data extraction-synthesis'!M7)),\"X\",\"\")","v":""},{"$nulls":3},{"$f":"IF(ISNUMBER(SEARCH(\"Strategists\",'Data extraction-synthesis'!M7)),\"X\",\"\")","v":""},null,null,{"$f":"IF(ISNUMBER(SEARCH(\"Other\",'Data extraction-synthesis'!M7)),\"X\",\"\")","v":""}]
["WHO","High-priority target product profile for hepatitis C diagnosis in decentralized settings: Report of a consensus meeting. ",{"$f":"IF(ISNUMBER(SEARCH(\"Industry (unspecific)\",'Data extraction-synthesis'!M8)),\"X\",\"\")","v":""},null,"X","Consensus-building",null,null,{"$f":"IF(ISNUMBER(SEARCH(\"Test developers\",'Data extraction-synthesis'!M8)),\"X\",\"\")","v":"X"},null,{"$f":"IF(ISNUMBER(SEARCH(\"Academia/researchers\",'Data extraction-synthesis'!M8)),\"X\",\"\")","v":"X"},"Consensus-building",null,null,{"$f":"IF(ISNUMBER(SEARCH(\"Clinicians\",'Data extraction-synthesis'!M8)),\"X\",\"\")","v":"X"},"Consensus-building",null,null,{"$f":"IF(ISNUMBER(SEARCH(\"Representatives of countries and national disease programs\",'Data extraction-synthesis'!M8)),\"X\",\"\")","v":"X"},"Consensus-building",null,null,{"$f":"IF(ISNUMBER(SEARCH(\"International/public health institution \",'Data extraction-synthesis'!M8)),\"X\",\"\")","v":"X"},"Consensus-building",null,null,{"$f":"IF(ISNUMBER(SEARCH(\"Experts (unspecific)\",'Data extraction-synthesis'!M8)),\"X\",\"\")","v":""},null,null,{"$f":"IF(ISNUMBER(SEARCH(\"Laboratory experts\",'Data extraction-synthesis'!M8)),\"X\",\"\")","v":""},null,null,{"$f":"IF(ISNUMBER(SEARCH(\"Non-profit sector\",'Data extraction-synthesis'!M8)),\"X\",\"\")","v":""},null,null,{"$f":"IF(ISNUMBER(SEARCH(\"Technical/funding agencies\",'Data extraction-synthesis'!M8)),\"X\",\"\")","v":"X"},"Consensus-building",null,null,{"$f":"IF(ISNUMBER(SEARCH(\"Policy makers\",'Data extraction-synthesis'!M8)),\"X\",\"\")","v":""},{"$nulls":3},{"$f":"IF(ISNUMBER(SEARCH(\"Implementers\",'Data extraction-synthesis'!M8)),\"X\",\"\")","v":"X"},"Consensus-building",null,null,{"$f":"IF(ISNUMBER(SEARCH(\"Patient/community advocates\",'Data extraction-synthesis'!M8)),\"X\",\"\")","v":"X"},"Consensus-building",null,null,{"$f":"IF(ISNUMBER(SEARCH(\"Microbiologists\",'Data extraction-synthesis'!M8)),\"X\",\"\")","v":""},{"$nulls":3},{"$f":"IF(ISNUMBER(SEARCH(\"Modelers\",'Data extraction-synthesis'!M8)),\"X\",\"\")","v":""},null,null,{"$f":"IF(ISNUMBER(SEARCH(\"Health economists\",'Data extraction-synthesis'!M8)),\"X\",\"\")","v":""},null,null,{"$f":"IF(ISNUMBER(SEARCH(\"Donors\",'Data extraction-synthesis'!M8)),\"X\",\"\")","v":""},null,null,{"$f":"IF(ISNUMBER(SEARCH(\"Market experts\",'Data extraction-synthesis'!M8)),\"X\",\"\")","v":""},{"$nulls":3},{"$f":"IF(ISNUMBER(SEARCH(\"Program manager\",'Data extraction-synthesis'!M8)),\"X\",\"\")","v":""},null,null,{"$f":"IF(ISNUMBER(SEARCH(\"Scientific associations\",'Data extraction-synthesis'!M8)),\"X\",\"\")","v":""},{"$nulls":3},{"$f":"IF(ISNUMBER(SEARCH(\"Strategists\",'Data extraction-synthesis'!M8)),\"X\",\"\")","v":""},null,null,{"$f":"IF(ISNUMBER(SEARCH(\"Other\",'Data extraction-synthesis'!M8)),\"X\",\"\")","v":"X"},"Consensus-building"]
["Gal, M. F., N. A.: Hood, K.: Villacian, J.: Goossens, H.: Watkins, A.: Butler, C. C.","Matching diagnostics development to clinical need: Target product profile development for a point of care test for community-acquired lower respiratory tract infection",{"$f":"IF(ISNUMBER(SEARCH(\"Industry (unspecific)\",'Data extraction-synthesis'!M9)),\"X\",\"\")","v":"X"},2,"X","Scoping","Drafting","Consensus-building",{"$f":"IF(ISNUMBER(SEARCH(\"Test developers\",'Data extraction-synthesis'!M9)),\"X\",\"\")","v":"X"},null,{"$f":"IF(ISNUMBER(SEARCH(\"Academia/researchers\",'Data extraction-synthesis'!M9)),\"X\",\"\")","v":"X"},"Scoping","Drafting","Consensus-building",{"$f":"IF(ISNUMBER(SEARCH(\"Clinicians\",'Data extraction-synthesis'!M9)),\"X\",\"\")","v":"X"},"Scoping","Drafting","Consensus-building",{"$f":"IF(ISNUMBER(SEARCH(\"Representatives of countries and national disease programs\",'Data extraction-synthesis'!M9)),\"X\",\"\")","v":""},{"$nulls":3},{"$f":"IF(ISNUMBER(SEARCH(\"International/public health institution \",'Data extraction-synthesis'!M9)),\"X\",\"\")","v":""},{"$nulls":3},{"$f":"IF(ISNUMBER(SEARCH(\"Experts (unspecific)\",'Data extraction-synthesis'!M9)),\"X\",\"\")","v":""},null,null,{"$f":"IF(ISNUMBER(SEARCH(\"Laboratory experts\",'Data extraction-synthesis'!M9)),\"X\",\"\")","v":""},null,null,{"$f":"IF(ISNUMBER(SEARCH(\"Non-profit sector\",'Data extraction-synthesis'!M9)),\"X\",\"\")","v":""},null,null,{"$f":"IF(ISNUMBER(SEARCH(\"Technical/funding agencies\",'Data extraction-synthesis'!M9)),\"X\",\"\")","v":""},{"$nulls":3},{"$f":"IF(ISNUMBER(SEARCH(\"Policy makers\",'Data extraction-synthesis'!M9)),\"X\",\"\")","v":""},{"$nulls":3},{"$f":"IF(ISNUMBER(SEARCH(\"Implementers\",'Data extraction-synthesis'!M9)),\"X\",\"\")","v":""},{"$nulls":3},{"$f":"IF(ISNUMBER(SEARCH(\"Patient/community advocates\",'Data extraction-synthesis'!M9)),\"X\",\"\")","v":""},{"$nulls":3},{"$f":"IF(ISNUMBER(SEARCH(\"Microbiologists\",'Data extraction-synthesis'!M9)),\"X\",\"\")","v":"X"},"Scoping","Drafting",null,{"$f":"IF(ISNUMBER(SEARCH(\"Modelers\",'Data extraction-synthesis'!M9)),\"X\",\"\")","v":""},null,null,{"$f":"IF(ISNUMBER(SEARCH(\"Health economists\",'Data extraction-synthesis'!M9)),\"X\",\"\")","v":""},null,null,{"$f":"IF(ISNUMBER(SEARCH(\"Donors\",'Data extraction-synthesis'!M9)),\"X\",\"\")","v":""},null,null,{"$f":"IF(ISNUMBER(SEARCH(\"Market experts\",'Data extraction-synthesis'!M9)),\"X\",\"\")","v":"X"},"Scoping","Drafting","Consensus-building",{"$f":"IF(ISNUMBER(SEARCH(\"Program manager\",'Data extraction-synthesis'!M9)),\"X\",\"\")","v":""},null,null,{"$f":"IF(ISNUMBER(SEARCH(\"Scientific associations\",'Data extraction-synthesis'!M9)),\"X\",\"\")","v":""},{"$nulls":3},{"$f":"IF(ISNUMBER(SEARCH(\"Strategists\",'Data extraction-synthesis'!M9)),\"X\",\"\")","v":""},null,null,{"$f":"IF(ISNUMBER(SEARCH(\"Other\",'Data extraction-synthesis'!M9)),\"X\",\"\")","v":""}]
["Lim, M. D. B., S. J.: Belizario, V. Y., Jr.: Gay-Andrieu, F.: Gilleard, J.: Levecke, B.: Lieshout, L. van: Medley, G. F.: Mekonnen, Z.: Mirams, G.: Njenga, S. M.: Odiere, M. R.: Rudge, J. W.: Stuyver, L.: Vercruysse, J.: Vlaminck, J.: Walson, J. L. ","Diagnostic tools for soil-transmitted helminths control and elimination programs: a pathway for diagnostic product development",{"$f":"IF(ISNUMBER(SEARCH(\"Industry (unspecific)\",'Data extraction-synthesis'!M10)),\"X\",\"\")","v":""},3,"X","Scoping","Drafting","Consensus-building",{"$f":"IF(ISNUMBER(SEARCH(\"Test developers\",'Data extraction-synthesis'!M10)),\"X\",\"\")","v":"X"},null,{"$f":"IF(ISNUMBER(SEARCH(\"Academia/researchers\",'Data extraction-synthesis'!M10)),\"X\",\"\")","v":"X"},"Scoping","Drafting","Consensus-building",{"$f":"IF(ISNUMBER(SEARCH(\"Clinicians\",'Data extraction-synthesis'!M10)),\"X\",\"\")","v":""},{"$nulls":3},{"$f":"IF(ISNUMBER(SEARCH(\"Representatives of countries and national disease programs\",'Data extraction-synthesis'!M10)),\"X\",\"\")","v":""},{"$nulls":3},{"$f":"IF(ISNUMBER(SEARCH(\"International/public health institution \",'Data extraction-synthesis'!M10)),\"X\",\"\")","v":""},{"$nulls":3},{"$f":"IF(ISNUMBER(SEARCH(\"Experts (unspecific)\",'Data extraction-synthesis'!M10)),\"X\",\"\")","v":""},null,null,{"$f":"IF(ISNUMBER(SEARCH(\"Laboratory experts\",'Data extraction-synthesis'!M10)),\"X\",\"\")","v":""},null,null,{"$f":"IF(ISNUMBER(SEARCH(\"Non-profit sector\",'Data extraction-synthesis'!M10)),\"X\",\"\")","v":""},null,null,{"$f":"IF(ISNUMBER(SEARCH(\"Technical/funding agencies\",'Data extraction-synthesis'!M10)),\"X\",\"\")","v":""},{"$nulls":3},{"$f":"IF(ISNUMBER(SEARCH(\"Policy makers\",'Data extraction-synthesis'!M10)),\"X\",\"\")","v":""},{"$nulls":3},{"$f":"IF(ISNUMBER(SEARCH(\"Implementers\",'Data extraction-synthesis'!M10)),\"X\",\"\")","v":"X"},"Scoping","Drafting","Consensus-building",{"$f":"IF(ISNUMBER(SEARCH(\"Patient/community advocates\",'Data extraction-synthesis'!M10)),\"X\",\"\")","v":""},{"$nulls":3},{"$f":"IF(ISNUMBER(SEARCH(\"Microbiologists\",'Data extraction-synthesis'!M10)),\"X\",\"\")","v":""},{"$nulls":3},{"$f":"IF(ISNUMBER(SEARCH(\"Modelers\",'Data extraction-synthesis'!M10)),\"X\",\"\")","v":""},null,null,{"$f":"IF(ISNUMBER(SEARCH(\"Health economists\",'Data extraction-synthesis'!M10)),\"X\",\"\")","v":""},null,null,{"$f":"IF(ISNUMBER(SEARCH(\"Donors\",'Data extraction-synthesis'!M10)),\"X\",\"\")","v":""},null,null,{"$f":"IF(ISNUMBER(SEARCH(\"Market experts\",'Data extraction-synthesis'!M10)),\"X\",\"\")","v":""},{"$nulls":3},{"$f":"IF(ISNUMBER(SEARCH(\"Program manager\",'Data extraction-synthesis'!M10)),\"X\",\"\")","v":""},null,null,{"$f":"IF(ISNUMBER(SEARCH(\"Scientific associations\",'Data extraction-synthesis'!M10)),\"X\",\"\")","v":""},{"$nulls":3},{"$f":"IF(ISNUMBER(SEARCH(\"Strategists\",'Data extraction-synthesis'!M10)),\"X\",\"\")","v":""},null,null,{"$f":"IF(ISNUMBER(SEARCH(\"Other\",'Data extraction-synthesis'!M10)),\"X\",\"\")","v":""}]
["Nsanzabana, C. A., Frederic: Beck, Hans-Peter: Ding, Xavier C.: Kamau, Edwin: Krishna, Sanjeev: Legrand, Eric: Lucchi, Naomi: Miotto, Olivo: Nag, Sidsel: Noedl, Harald: Roper, Cally: Rosenthal, Philip J.: Schallig, Henk D. F. H.: Taylor, Steve M.: Volkman, Sarah K.: Gonzalez, Iveth J.","Molecular assays for antimalarial drug resistance surveillance: A target product profile",{"$f":"IF(ISNUMBER(SEARCH(\"Industry (unspecific)\",'Data extraction-synthesis'!M11)),\"X\",\"\")","v":"X"},null,"X","Consensus-building",null,null,{"$f":"IF(ISNUMBER(SEARCH(\"Test developers\",'Data extraction-synthesis'!M11)),\"X\",\"\")","v":""},null,{"$f":"IF(ISNUMBER(SEARCH(\"Academia/researchers\",'Data extraction-synthesis'!M11)),\"X\",\"\")","v":"X"},"Consensus-building",null,null,{"$f":"IF(ISNUMBER(SEARCH(\"Clinicians\",'Data extraction-synthesis'!M11)),\"X\",\"\")","v":""},{"$nulls":3},{"$f":"IF(ISNUMBER(SEARCH(\"Representatives of countries and national disease programs\",'Data extraction-synthesis'!M11)),\"X\",\"\")","v":""},{"$nulls":3},{"$f":"IF(ISNUMBER(SEARCH(\"International/public health institution \",'Data extraction-synthesis'!M11)),\"X\",\"\")","v":"X"},"Consensus-building",null,null,{"$f":"IF(ISNUMBER(SEARCH(\"Experts (unspecific)\",'Data extraction-synthesis'!M11)),\"X\",\"\")","v":""},null,null,{"$f":"IF(ISNUMBER(SEARCH(\"Laboratory experts\",'Data extraction-synthesis'!M11)),\"X\",\"\")","v":""},null,null,{"$f":"IF(ISNUMBER(SEARCH(\"Non-profit sector\",'Data extraction-synthesis'!M11)),\"X\",\"\")","v":""},null,null,{"$f":"IF(ISNUMBER(SEARCH(\"Technical/funding agencies\",'Data extraction-synthesis'!M11)),\"X\",\"\")","v":""},{"$nulls":3},{"$f":"IF(ISNUMBER(SEARCH(\"Policy makers\",'Data extraction-synthesis'!M11)),\"X\",\"\")","v":""},{"$nulls":3},{"$f":"IF(ISNUMBER(SEARCH(\"Implementers\",'Data extraction-synthesis'!M11)),\"X\",\"\")","v":""},{"$nulls":3},{"$f":"IF(ISNUMBER(SEARCH(\"Patient/community advocates\",'Data extraction-synthesis'!M11)),\"X\",\"\")","v":""},{"$nulls":3},{"$f":"IF(ISNUMBER(SEARCH(\"Microbiologists\",'Data extraction-synthesis'!M11)),\"X\",\"\")","v":""},{"$nulls":3},{"$f":"IF(ISNUMBER(SEARCH(\"Modelers\",'Data extraction-synthesis'!M11)),\"X\",\"\")","v":""},null,null,{"$f":"IF(ISNUMBER(SEARCH(\"Health economists\",'Data extraction-synthesis'!M11)),\"X\",\"\")","v":""},null,null,{"$f":"IF(ISNUMBER(SEARCH(\"Donors\",'Data extraction-synthesis'!M11)),\"X\",\"\")","v":""},null,null,{"$f":"IF(ISNUMBER(SEARCH(\"Market experts\",'Data extraction-synthesis'!M11)),\"X\",\"\")","v":""},{"$nulls":3},{"$f":"IF(ISNUMBER(SEARCH(\"Program manager\",'Data extraction-synthesis'!M11)),\"X\",\"\")","v":""},null,null,{"$f":"IF(ISNUMBER(SEARCH(\"Scientific associations\",'Data extraction-synthesis'!M11)),\"X\",\"\")","v":""},{"$nulls":3},{"$f":"IF(ISNUMBER(SEARCH(\"Strategists\",'Data extraction-synthesis'!M11)),\"X\",\"\")","v":""},null,null,{"$f":"IF(ISNUMBER(SEARCH(\"Other\",'Data extraction-synthesis'!M11)),\"X\",\"\")","v":""}]
["Porras, A. I. Y., Z. E.: Altcheh, J.: Britto, C.: Chaves, G. C.: Flevaud, L.: Martins, O. A.: Ribeiro, I.: Schijman, A. G.: Shikanai-Yasuda, M. A.: Sosa-Estani, S.: Stobbaerts, E.: Zicker, F.","Target Product Profile (TPP) for Chagas Disease Point-of-Care Diagnosis and Assessment of Response to Treatmen",{"$f":"IF(ISNUMBER(SEARCH(\"Industry (unspecific)\",'Data extraction-synthesis'!M12)),\"X\",\"\")","v":""},null,"",{"$nulls":3},{"$f":"IF(ISNUMBER(SEARCH(\"Test developers\",'Data extraction-synthesis'!M12)),\"X\",\"\")","v":""},null,{"$f":"IF(ISNUMBER(SEARCH(\"Academia/researchers\",'Data extraction-synthesis'!M12)),\"X\",\"\")","v":""},{"$nulls":3},{"$f":"IF(ISNUMBER(SEARCH(\"Clinicians\",'Data extraction-synthesis'!M12)),\"X\",\"\")","v":""},{"$nulls":3},{"$f":"IF(ISNUMBER(SEARCH(\"Representatives of countries and national disease programs\",'Data extraction-synthesis'!M12)),\"X\",\"\")","v":""},{"$nulls":3},{"$f":"IF(ISNUMBER(SEARCH(\"International/public health institution \",'Data extraction-synthesis'!M12)),\"X\",\"\")","v":""},{"$nulls":3},{"$f":"IF(ISNUMBER(SEARCH(\"Experts (unspecific)\",'Data extraction-synthesis'!M12)),\"X\",\"\")","v":""},null,null,{"$f":"IF(ISNUMBER(SEARCH(\"Laboratory experts\",'Data extraction-synthesis'!M12)),\"X\",\"\")","v":""},null,null,{"$f":"IF(ISNUMBER(SEARCH(\"Non-profit sector\",'Data extraction-synthesis'!M12)),\"X\",\"\")","v":""},null,null,{"$f":"IF(ISNUMBER(SEARCH(\"Technical/funding agencies\",'Data extraction-synthesis'!M12)),\"X\",\"\")","v":""},{"$nulls":3},{"$f":"IF(ISNUMBER(SEARCH(\"Policy makers\",'Data extraction-synthesis'!M12)),\"X\",\"\")","v":""},{"$nulls":3},{"$f":"IF(ISNUMBER(SEARCH(\"Implementers\",'Data extraction-synthesis'!M12)),\"X\",\"\")","v":""},{"$nulls":3},{"$f":"IF(ISNUMBER(SEARCH(\"Patient/community advocates\",'Data extraction-synthesis'!M12)),\"X\",\"\")","v":""},{"$nulls":3},{"$f":"IF(ISNUMBER(SEARCH(\"Microbiologists\",'Data extraction-synthesis'!M12)),\"X\",\"\")","v":""},{"$nulls":3},{"$f":"IF(ISNUMBER(SEARCH(\"Modelers\",'Data extraction-synthesis'!M12)),\"X\",\"\")","v":""},null,null,{"$f":"IF(ISNUMBER(SEARCH(\"Health economists\",'Data extraction-synthesis'!M12)),\"X\",\"\")","v":""},null,null,{"$f":"IF(ISNUMBER(SEARCH(\"Donors\",'Data extraction-synthesis'!M12)),\"X\",\"\")","v":""},null,null,{"$f":"IF(ISNUMBER(SEARCH(\"Market experts\",'Data extraction-synthesis'!M12)),\"X\",\"\")","v":""},{"$nulls":3},{"$f":"IF(ISNUMBER(SEARCH(\"Program manager\",'Data extraction-synthesis'!M12)),\"X\",\"\")","v":""},null,null,{"$f":"IF(ISNUMBER(SEARCH(\"Scientific associations\",'Data extraction-synthesis'!M12)),\"X\",\"\")","v":""},{"$nulls":3},{"$f":"IF(ISNUMBER(SEARCH(\"Strategists\",'Data extraction-synthesis'!M12)),\"X\",\"\")","v":""},null,null,{"$f":"IF(ISNUMBER(SEARCH(\"Other\",'Data extraction-synthesis'!M12)),\"X\",\"\")","v":""}]
["Reipold, E. I. E., Philippa: Trianni, Alessandra: Panneer, Nivedha: Krakower, Douglas: Ongarello, Stefano: Roberts, Teri: Miller, Veronica: Denkinger, Claudia","Optimising diagnosis of viraemic hepatitis C infection: the development of a target product profile",{"$f":"IF(ISNUMBER(SEARCH(\"Industry (unspecific)\",'Data extraction-synthesis'!M13)),\"X\",\"\")","v":"X"},4,"X","Drafting","Scoping","Consensus-building",{"$f":"IF(ISNUMBER(SEARCH(\"Test developers\",'Data extraction-synthesis'!M13)),\"X\",\"\")","v":""},null,{"$f":"IF(ISNUMBER(SEARCH(\"Academia/researchers\",'Data extraction-synthesis'!M13)),\"X\",\"\")","v":"X"},"Drafting","Scoping","Consensus-building",{"$f":"IF(ISNUMBER(SEARCH(\"Clinicians\",'Data extraction-synthesis'!M13)),\"X\",\"\")","v":"X"},"Drafting","Scoping","Consensus-building",{"$f":"IF(ISNUMBER(SEARCH(\"Representatives of countries and national disease programs\",'Data extraction-synthesis'!M13)),\"X\",\"\")","v":"X"},"Drafting","Scoping","Consensus-building",{"$f":"IF(ISNUMBER(SEARCH(\"International/public health institution \",'Data extraction-synthesis'!M13)),\"X\",\"\")","v":"X"},"Drafting","Scoping","Consensus-building",{"$f":"IF(ISNUMBER(SEARCH(\"Experts (unspecific)\",'Data extraction-synthesis'!M13)),\"X\",\"\")","v":""},null,null,{"$f":"IF(ISNUMBER(SEARCH(\"Laboratory experts\",'Data extraction-synthesis'!M13)),\"X\",\"\")","v":""},null,null,{"$f":"IF(ISNUMBER(SEARCH(\"Non-profit sector\",'Data extraction-synthesis'!M13)),\"X\",\"\")","v":""},null,null,{"$f":"IF(ISNUMBER(SEARCH(\"Technical/funding agencies\",'Data extraction-synthesis'!M13)),\"X\",\"\")","v":"X"},"Drafting","Scoping","Consensus-building",{"$f":"IF(ISNUMBER(SEARCH(\"Policy makers\",'Data extraction-synthesis'!M13)),\"X\",\"\")","v":"X"},"Consensus-building",null,null,{"$f":"IF(ISNUMBER(SEARCH(\"Implementers\",'Data extraction-synthesis'!M13)),\"X\",\"\")","v":"X"},"Drafting","Scoping","Consensus-building",{"$f":"IF(ISNUMBER(SEARCH(\"Patient/community advocates\",'Data extraction-synthesis'!M13)),\"X\",\"\")","v":"X"},"Drafting","Scoping","Consensus-building",{"$f":"IF(ISNUMBER(SEARCH(\"Microbiologists\",'Data extraction-synthesis'!M13)),\"X\",\"\")","v":""},{"$nulls":3},{"$f":"IF(ISNUMBER(SEARCH(\"Modelers\",'Data extraction-synthesis'!M13)),\"X\",\"\")","v":""},null,null,{"$f":"IF(ISNUMBER(SEARCH(\"Health economists\",'Data extraction-synthesis'!M13)),\"X\",\"\")","v":""},null,null,{"$f":"IF(ISNUMBER(SEARCH(\"Donors\",'Data extraction-synthesis'!M13)),\"X\",\"\")","v":""},null,null,{"$f":"IF(ISNUMBER(SEARCH(\"Market experts\",'Data extraction-synthesis'!M13)),\"X\",\"\")","v":""},{"$nulls":3},{"$f":"IF(ISNUMBER(SEARCH(\"Program manager\",'Data extraction-synthesis'!M13)),\"X\",\"\")","v":"X"},"Consensus-building",null,{"$f":"IF(ISNUMBER(SEARCH(\"Scientific associations\",'Data extraction-synthesis'!M13)),\"X\",\"\")","v":""},{"$nulls":3},{"$f":"IF(ISNUMBER(SEARCH(\"Strategists\",'Data extraction-synthesis'!M13)),\"X\",\"\")","v":""},null,null,{"$f":"IF(ISNUMBER(SEARCH(\"Other\",'Data extraction-synthesis'!M13)),\"X\",\"\")","v":""}]
["Solomon, A. W. E., D.: Bailey, R. L.: Blake, I. M.: Brooker, S.: Chen, J. X.: Chen, J. H.: Churcher, T. S.: Drakeley, C. J.: Edwards, T.: Fenwick, A.: French, M.: Gabrielli, A. F.: Grassly, N. C.: Harding-Esch, E. M.: Holland, M. J.: Koukounari, A.: Lammie, P. J.: Leslie, J.: Mabey, D. C.: Rhajaoui, M.: Secor, W. E.: Stothard, J. R.: Wei, H.: Willingham, A. L.: Zhou, X. N.: Peeling, R. W.","A diagnostics platform for the integrated mapping, monitoring, and surveillance of neglected tropical diseases: Rationale and target product profiles",{"$f":"IF(ISNUMBER(SEARCH(\"Industry (unspecific)\",'Data extraction-synthesis'!M14)),\"X\",\"\")","v":""},null,"",{"$nulls":3},{"$f":"IF(ISNUMBER(SEARCH(\"Test developers\",'Data extraction-synthesis'!M14)),\"X\",\"\")","v":""},null,{"$f":"IF(ISNUMBER(SEARCH(\"Academia/researchers\",'Data extraction-synthesis'!M14)),\"X\",\"\")","v":""},{"$nulls":3},{"$f":"IF(ISNUMBER(SEARCH(\"Clinicians\",'Data extraction-synthesis'!M14)),\"X\",\"\")","v":""},{"$nulls":3},{"$f":"IF(ISNUMBER(SEARCH(\"Representatives of countries and national disease programs\",'Data extraction-synthesis'!M14)),\"X\",\"\")","v":""},{"$nulls":3},{"$f":"IF(ISNUMBER(SEARCH(\"International/public health institution \",'Data extraction-synthesis'!M14)),\"X\",\"\")","v":""},{"$nulls":3},{"$f":"IF(ISNUMBER(SEARCH(\"Experts (unspecific)\",'Data extraction-synthesis'!M14)),\"X\",\"\")","v":"X"},"Drafting","Consensus-building",{"$f":"IF(ISNUMBER(SEARCH(\"Laboratory experts\",'Data extraction-synthesis'!M14)),\"X\",\"\")","v":"X"},"Drafting","Consensus-building",{"$f":"IF(ISNUMBER(SEARCH(\"Non-profit sector\",'Data extraction-synthesis'!M14)),\"X\",\"\")","v":""},null,null,{"$f":"IF(ISNUMBER(SEARCH(\"Technical/funding agencies\",'Data extraction-synthesis'!M14)),\"X\",\"\")","v":""},{"$nulls":3},{"$f":"IF(ISNUMBER(SEARCH(\"Policy makers\",'Data extraction-synthesis'!M14)),\"X\",\"\")","v":""},{"$nulls":3},{"$f":"IF(ISNUMBER(SEARCH(\"Implementers\",'Data extraction-synthesis'!M14)),\"X\",\"\")","v":""},{"$nulls":3},{"$f":"IF(ISNUMBER(SEARCH(\"Patient/community advocates\",'Data extraction-synthesis'!M14)),\"X\",\"\")","v":""},{"$nulls":3},{"$f":"IF(ISNUMBER(SEARCH(\"Microbiologists\",'Data extraction-synthesis'!M14)),\"X\",\"\")","v":""},{"$nulls":3},{"$f":"IF(ISNUMBER(SEARCH(\"Modelers\",'Data extraction-synthesis'!M14)),\"X\",\"\")","v":"X"},"Drafting","Consensus-building",{"$f":"IF(ISNUMBER(SEARCH(\"Health economists\",'Data extraction-synthesis'!M14)),\"X\",\"\")","v":"X"},"Drafting","Consensus-building",{"$f":"IF(ISNUMBER(SEARCH(\"Donors\",'Data extraction-synthesis'!M14)),\"X\",\"\")","v":""},null,null,{"$f":"IF(ISNUMBER(SEARCH(\"Market experts\",'Data extraction-synthesis'!M14)),\"X\",\"\")","v":""},{"$nulls":3},{"$f":"IF(ISNUMBER(SEARCH(\"Program manager\",'Data extraction-synthesis'!M14)),\"X\",\"\")","v":"X"},"Drafting","Consensus-building",{"$f":"IF(ISNUMBER(SEARCH(\"Scientific associations\",'Data extraction-synthesis'!M14)),\"X\",\"\")","v":""},{"$nulls":3},{"$f":"IF(ISNUMBER(SEARCH(\"Strategists\",'Data extraction-synthesis'!M14)),\"X\",\"\")","v":""},null,null,{"$f":"IF(ISNUMBER(SEARCH(\"Other\",'Data extraction-synthesis'!M14)),\"X\",\"\")","v":""}]
["Toskin, I. M., M.: Peeling, R. W.: Blondeel, K.: Cordero, J.: Kiarie, J.","Advancing prevention of sexually transmitted infections through point-of-care testing: target product profiles and landscape analysis",{"$f":"IF(ISNUMBER(SEARCH(\"Industry (unspecific)\",'Data extraction-synthesis'!M15)),\"X\",\"\")","v":""},5,"X","Scoping","Drafting",null,{"$f":"IF(ISNUMBER(SEARCH(\"Test developers\",'Data extraction-synthesis'!M15)),\"X\",\"\")","v":"X"},null,{"$f":"IF(ISNUMBER(SEARCH(\"Academia/researchers\",'Data extraction-synthesis'!M15)),\"X\",\"\")","v":""},{"$nulls":3},{"$f":"IF(ISNUMBER(SEARCH(\"Clinicians\",'Data extraction-synthesis'!M15)),\"X\",\"\")","v":"X"},"Drafting","Consensus-building",null,{"$f":"IF(ISNUMBER(SEARCH(\"Representatives of countries and national disease programs\",'Data extraction-synthesis'!M15)),\"X\",\"\")","v":""},{"$nulls":3},{"$f":"IF(ISNUMBER(SEARCH(\"International/public health institution \",'Data extraction-synthesis'!M15)),\"X\",\"\")","v":"X"},"Drafting","Consensus-building",null,{"$f":"IF(ISNUMBER(SEARCH(\"Experts (unspecific)\",'Data extraction-synthesis'!M15)),\"X\",\"\")","v":"X"},"Drafting","Consensus-building",{"$f":"IF(ISNUMBER(SEARCH(\"Laboratory experts\",'Data extraction-synthesis'!M15)),\"X\",\"\")","v":"X"},"Drafting","Consensus-building",{"$f":"IF(ISNUMBER(SEARCH(\"Non-profit sector\",'Data extraction-synthesis'!M15)),\"X\",\"\")","v":""},null,null,{"$f":"IF(ISNUMBER(SEARCH(\"Technical/funding agencies\",'Data extraction-synthesis'!M15)),\"X\",\"\")","v":""},{"$nulls":3},{"$f":"IF(ISNUMBER(SEARCH(\"Policy makers\",'Data extraction-synthesis'!M15)),\"X\",\"\")","v":""},{"$nulls":3},{"$f":"IF(ISNUMBER(SEARCH(\"Implementers\",'Data extraction-synthesis'!M15)),\"X\",\"\")","v":""},{"$nulls":3},{"$f":"IF(ISNUMBER(SEARCH(\"Patient/community advocates\",'Data extraction-synthesis'!M15)),\"X\",\"\")","v":""},{"$nulls":3},{"$f":"IF(ISNUMBER(SEARCH(\"Microbiologists\",'Data extraction-synthesis'!M15)),\"X\",\"\")","v":"X"},"Drafting",null,"Consensus-building",{"$f":"IF(ISNUMBER(SEARCH(\"Modelers\",'Data extraction-synthesis'!M15)),\"X\",\"\")","v":""},null,null,{"$f":"IF(ISNUMBER(SEARCH(\"Health economists\",'Data extraction-synthesis'!M15)),\"X\",\"\")","v":""},null,null,{"$f":"IF(ISNUMBER(SEARCH(\"Donors\",'Data extraction-synthesis'!M15)),\"X\",\"\")","v":""},null,null,{"$f":"IF(ISNUMBER(SEARCH(\"Market experts\",'Data extraction-synthesis'!M15)),\"X\",\"\")","v":""},{"$nulls":3},{"$f":"IF(ISNUMBER(SEARCH(\"Program manager\",'Data extraction-synthesis'!M15)),\"X\",\"\")","v":""},null,null,{"$f":"IF(ISNUMBER(SEARCH(\"Scientific associations\",'Data extraction-synthesis'!M15)),\"X\",\"\")","v":""},{"$nulls":3},{"$f":"IF(ISNUMBER(SEARCH(\"Strategists\",'Data extraction-synthesis'!M15)),\"X\",\"\")","v":""},null,null,{"$f":"IF(ISNUMBER(SEARCH(\"Other\",'Data extraction-synthesis'!M15)),\"X\",\"\")","v":""}]
["Donadeu, M. F., A. S.: Olliaro, P. L.: Abela-Ridder, B","Target product profiles for the diagnosis of Taenia solium taeniasis, neurocysticercosis and porcine cysticercosis",{"$f":"IF(ISNUMBER(SEARCH(\"Industry (unspecific)\",'Data extraction-synthesis'!M16)),\"X\",\"\")","v":"X"},null,"X","Consensus-building",null,null,{"$f":"IF(ISNUMBER(SEARCH(\"Test developers\",'Data extraction-synthesis'!M16)),\"X\",\"\")","v":""},null,{"$f":"IF(ISNUMBER(SEARCH(\"Academia/researchers\",'Data extraction-synthesis'!M16)),\"X\",\"\")","v":"X"},"Consensus-building",null,null,{"$f":"IF(ISNUMBER(SEARCH(\"Clinicians\",'Data extraction-synthesis'!M16)),\"X\",\"\")","v":"X"},"Consensus-building",null,null,{"$f":"IF(ISNUMBER(SEARCH(\"Representatives of countries and national disease programs\",'Data extraction-synthesis'!M16)),\"X\",\"\")","v":"X"},"Consensus-building",null,null,{"$f":"IF(ISNUMBER(SEARCH(\"International/public health institution \",'Data extraction-synthesis'!M16)),\"X\",\"\")","v":"X"},"Scoping","Consensus-building",null,{"$f":"IF(ISNUMBER(SEARCH(\"Experts (unspecific)\",'Data extraction-synthesis'!M16)),\"X\",\"\")","v":"X"},"Consensus-building",null,{"$f":"IF(ISNUMBER(SEARCH(\"Laboratory experts\",'Data extraction-synthesis'!M16)),\"X\",\"\")","v":""},null,null,"x","Consensus-building",null,{"$f":"IF(ISNUMBER(SEARCH(\"Technical/funding agencies\",'Data extraction-synthesis'!M16)),\"X\",\"\")","v":""},{"$nulls":3},"x","Consensus-building",null,null,{"$f":"IF(ISNUMBER(SEARCH(\"Implementers\",'Data extraction-synthesis'!M16)),\"X\",\"\")","v":""},{"$nulls":3},{"$f":"IF(ISNUMBER(SEARCH(\"Patient/community advocates\",'Data extraction-synthesis'!M16)),\"X\",\"\")","v":""},{"$nulls":3},{"$f":"IF(ISNUMBER(SEARCH(\"Microbiologists\",'Data extraction-synthesis'!M16)),\"X\",\"\")","v":""},{"$nulls":3},{"$f":"IF(ISNUMBER(SEARCH(\"Modelers\",'Data extraction-synthesis'!M16)),\"X\",\"\")","v":""},null,null,{"$f":"IF(ISNUMBER(SEARCH(\"Health economists\",'Data extraction-synthesis'!M16)),\"X\",\"\")","v":""},null,null,{"$f":"IF(ISNUMBER(SEARCH(\"Donors\",'Data extraction-synthesis'!M16)),\"X\",\"\")","v":""},null,null,{"$f":"IF(ISNUMBER(SEARCH(\"Market experts\",'Data extraction-synthesis'!M16)),\"X\",\"\")","v":""},{"$nulls":3},{"$f":"IF(ISNUMBER(SEARCH(\"Program manager\",'Data extraction-synthesis'!M16)),\"X\",\"\")","v":""},null,null,{"$f":"IF(ISNUMBER(SEARCH(\"Scientific associations\",'Data extraction-synthesis'!M16)),\"X\",\"\")","v":""},{"$nulls":3},{"$f":"IF(ISNUMBER(SEARCH(\"Strategists\",'Data extraction-synthesis'!M16)),\"X\",\"\")","v":""},null,null,{"$f":"IF(ISNUMBER(SEARCH(\"Other\",'Data extraction-synthesis'!M16)),\"X\",\"\")","v":""}]
["FIND","Target Product Profile for Tests for Recent HIV Infection",{"$f":"IF(ISNUMBER(SEARCH(\"Industry (unspecific)\",'Data extraction-synthesis'!M17)),\"X\",\"\")","v":"X"},6,"X","Scoping",null,"Consensus-building",{"$f":"IF(ISNUMBER(SEARCH(\"Test developers\",'Data extraction-synthesis'!M17)),\"X\",\"\")","v":""},null,{"$f":"IF(ISNUMBER(SEARCH(\"Academia/researchers\",'Data extraction-synthesis'!M17)),\"X\",\"\")","v":"X"},"Scoping","Drafting","Consensus-building",{"$f":"IF(ISNUMBER(SEARCH(\"Clinicians\",'Data extraction-synthesis'!M17)),\"X\",\"\")","v":""},{"$nulls":3},{"$f":"IF(ISNUMBER(SEARCH(\"Representatives of countries and national disease programs\",'Data extraction-synthesis'!M17)),\"X\",\"\")","v":""},{"$nulls":3},{"$f":"IF(ISNUMBER(SEARCH(\"International/public health institution \",'Data extraction-synthesis'!M17)),\"X\",\"\")","v":"X"},"Scoping","Drafting","Consensus-building",{"$f":"IF(ISNUMBER(SEARCH(\"Experts (unspecific)\",'Data extraction-synthesis'!M17)),\"X\",\"\")","v":""},null,null,{"$f":"IF(ISNUMBER(SEARCH(\"Laboratory experts\",'Data extraction-synthesis'!M17)),\"X\",\"\")","v":""},null,null,{"$f":"IF(ISNUMBER(SEARCH(\"Non-profit sector\",'Data extraction-synthesis'!M17)),\"X\",\"\")","v":"X"},null,null,{"$f":"IF(ISNUMBER(SEARCH(\"Technical/funding agencies\",'Data extraction-synthesis'!M17)),\"X\",\"\")","v":""},{"$nulls":3},{"$f":"IF(ISNUMBER(SEARCH(\"Policy makers\",'Data extraction-synthesis'!M17)),\"X\",\"\")","v":"X"},"Scoping","Drafting","Consensus-building",{"$f":"IF(ISNUMBER(SEARCH(\"Implementers\",'Data extraction-synthesis'!M17)),\"X\",\"\")","v":""},{"$nulls":3},{"$f":"IF(ISNUMBER(SEARCH(\"Patient/community advocates\",'Data extraction-synthesis'!M17)),\"X\",\"\")","v":""},{"$nulls":3},{"$f":"IF(ISNUMBER(SEARCH(\"Microbiologists\",'Data extraction-synthesis'!M17)),\"X\",\"\")","v":""},{"$nulls":3},{"$f":"IF(ISNUMBER(SEARCH(\"Modelers\",'Data extraction-synthesis'!M17)),\"X\",\"\")","v":""},null,null,{"$f":"IF(ISNUMBER(SEARCH(\"Health economists\",'Data extraction-synthesis'!M17)),\"X\",\"\")","v":""},null,null,{"$f":"IF(ISNUMBER(SEARCH(\"Donors\",'Data extraction-synthesis'!M17)),\"X\",\"\")","v":""},null,null,{"$f":"IF(ISNUMBER(SEARCH(\"Market experts\",'Data extraction-synthesis'!M17)),\"X\",\"\")","v":""},{"$nulls":3},{"$f":"IF(ISNUMBER(SEARCH(\"Program manager\",'Data extraction-synthesis'!M17)),\"X\",\"\")","v":""},null,null,{"$f":"IF(ISNUMBER(SEARCH(\"Scientific associations\",'Data extraction-synthesis'!M17)),\"X\",\"\")","v":"X"},"Scoping","Drafting","Consensus-building",{"$f":"IF(ISNUMBER(SEARCH(\"Strategists\",'Data extraction-synthesis'!M17)),\"X\",\"\")","v":""},null,null,{"$f":"IF(ISNUMBER(SEARCH(\"Other\",'Data extraction-synthesis'!M17)),\"X\",\"\")","v":""}]
["FIND","Target Product Profile: Rapid test for diagnosis of malaria and screening for hyman African trypanosomiasis (HAT)",{"$f":"IF(ISNUMBER(SEARCH(\"Industry (unspecific)\",'Data extraction-synthesis'!M18)),\"X\",\"\")","v":"X"},null,"X","Consensus-building",null,null,{"$f":"IF(ISNUMBER(SEARCH(\"Test developers\",'Data extraction-synthesis'!M18)),\"X\",\"\")","v":""},null,{"$f":"IF(ISNUMBER(SEARCH(\"Academia/researchers\",'Data extraction-synthesis'!M18)),\"X\",\"\")","v":"X"},"Consensus-building",null,null,{"$f":"IF(ISNUMBER(SEARCH(\"Clinicians\",'Data extraction-synthesis'!M18)),\"X\",\"\")","v":""},{"$nulls":3},{"$f":"IF(ISNUMBER(SEARCH(\"Representatives of countries and national disease programs\",'Data extraction-synthesis'!M18)),\"X\",\"\")","v":""},{"$nulls":3},{"$f":"IF(ISNUMBER(SEARCH(\"International/public health institution \",'Data extraction-synthesis'!M18)),\"X\",\"\")","v":""},{"$nulls":3},{"$f":"IF(ISNUMBER(SEARCH(\"Experts (unspecific)\",'Data extraction-synthesis'!M18)),\"X\",\"\")","v":""},null,null,{"$f":"IF(ISNUMBER(SEARCH(\"Laboratory experts\",'Data extraction-synthesis'!M18)),\"X\",\"\")","v":""},null,null,{"$f":"IF(ISNUMBER(SEARCH(\"Non-profit sector\",'Data extraction-synthesis'!M18)),\"X\",\"\")","v":"X"},"Consensus-building",null,{"$f":"IF(ISNUMBER(SEARCH(\"Technical/funding agencies\",'Data extraction-synthesis'!M18)),\"X\",\"\")","v":""},{"$nulls":3},{"$f":"IF(ISNUMBER(SEARCH(\"Policy makers\",'Data extraction-synthesis'!M18)),\"X\",\"\")","v":""},{"$nulls":3},{"$f":"IF(ISNUMBER(SEARCH(\"Implementers\",'Data extraction-synthesis'!M18)),\"X\",\"\")","v":""},{"$nulls":3},{"$f":"IF(ISNUMBER(SEARCH(\"Patient/community advocates\",'Data extraction-synthesis'!M18)),\"X\",\"\")","v":""},{"$nulls":3},{"$f":"IF(ISNUMBER(SEARCH(\"Microbiologists\",'Data extraction-synthesis'!M18)),\"X\",\"\")","v":""},{"$nulls":3},{"$f":"IF(ISNUMBER(SEARCH(\"Modelers\",'Data extraction-synthesis'!M18)),\"X\",\"\")","v":""},null,null,{"$f":"IF(ISNUMBER(SEARCH(\"Health economists\",'Data extraction-synthesis'!M18)),\"X\",\"\")","v":""},null,null,{"$f":"IF(ISNUMBER(SEARCH(\"Donors\",'Data extraction-synthesis'!M18)),\"X\",\"\")","v":""},null,null,{"$f":"IF(ISNUMBER(SEARCH(\"Market experts\",'Data extraction-synthesis'!M18)),\"X\",\"\")","v":""},{"$nulls":3},{"$f":"IF(ISNUMBER(SEARCH(\"Program manager\",'Data extraction-synthesis'!M18)),\"X\",\"\")","v":""},null,null,{"$f":"IF(ISNUMBER(SEARCH(\"Scientific associations\",'Data extraction-synthesis'!M18)),\"X\",\"\")","v":""},{"$nulls":3},{"$f":"IF(ISNUMBER(SEARCH(\"Strategists\",'Data extraction-synthesis'!M18)),\"X\",\"\")","v":""},null,null,{"$f":"IF(ISNUMBER(SEARCH(\"Other\",'Data extraction-synthesis'!M18)),\"X\",\"\")","v":""}]
["PATH","Target Product Profile: HIV Self-Test Version 4.1: A White Paper on the Evaluation of Current HIV Rapid Tests and Development of Core Specifications for Next-Generation HIV Tests",{"$f":"IF(ISNUMBER(SEARCH(\"Industry (unspecific)\",'Data extraction-synthesis'!M19)),\"X\",\"\")","v":""},null,"",{"$nulls":3},{"$f":"IF(ISNUMBER(SEARCH(\"Test developers\",'Data extraction-synthesis'!M19)),\"X\",\"\")","v":""},null,{"$f":"IF(ISNUMBER(SEARCH(\"Academia/researchers\",'Data extraction-synthesis'!M19)),\"X\",\"\")","v":""},{"$nulls":3},{"$f":"IF(ISNUMBER(SEARCH(\"Clinicians\",'Data extraction-synthesis'!M19)),\"X\",\"\")","v":""},{"$nulls":3},{"$f":"IF(ISNUMBER(SEARCH(\"Representatives of countries and national disease programs\",'Data extraction-synthesis'!M19)),\"X\",\"\")","v":""},{"$nulls":3},{"$f":"IF(ISNUMBER(SEARCH(\"International/public health institution \",'Data extraction-synthesis'!M19)),\"X\",\"\")","v":""},{"$nulls":3},{"$f":"IF(ISNUMBER(SEARCH(\"Experts (unspecific)\",'Data extraction-synthesis'!M19)),\"X\",\"\")","v":""},null,null,{"$f":"IF(ISNUMBER(SEARCH(\"Laboratory experts\",'Data extraction-synthesis'!M19)),\"X\",\"\")","v":""},null,null,{"$f":"IF(ISNUMBER(SEARCH(\"Non-profit sector\",'Data extraction-synthesis'!M19)),\"X\",\"\")","v":""},null,null,{"$f":"IF(ISNUMBER(SEARCH(\"Technical/funding agencies\",'Data extraction-synthesis'!M19)),\"X\",\"\")","v":""},{"$nulls":3},{"$f":"IF(ISNUMBER(SEARCH(\"Policy makers\",'Data extraction-synthesis'!M19)),\"X\",\"\")","v":""},{"$nulls":3},{"$f":"IF(ISNUMBER(SEARCH(\"Implementers\",'Data extraction-synthesis'!M19)),\"X\",\"\")","v":""},{"$nulls":3},{"$f":"IF(ISNUMBER(SEARCH(\"Patient/community advocates\",'Data extraction-synthesis'!M19)),\"X\",\"\")","v":""},{"$nulls":3},{"$f":"IF(ISNUMBER(SEARCH(\"Microbiologists\",'Data extraction-synthesis'!M19)),\"X\",\"\")","v":""},{"$nulls":3},{"$f":"IF(ISNUMBER(SEARCH(\"Modelers\",'Data extraction-synthesis'!M19)),\"X\",\"\")","v":""},null,null,{"$f":"IF(ISNUMBER(SEARCH(\"Health economists\",'Data extraction-synthesis'!M19)),\"X\",\"\")","v":""},null,null,{"$f":"IF(ISNUMBER(SEARCH(\"Donors\",'Data extraction-synthesis'!M19)),\"X\",\"\")","v":""},null,null,{"$f":"IF(ISNUMBER(SEARCH(\"Market experts\",'Data extraction-synthesis'!M19)),\"X\",\"\")","v":""},{"$nulls":3},{"$f":"IF(ISNUMBER(SEARCH(\"Program manager\",'Data extraction-synthesis'!M19)),\"X\",\"\")","v":""},null,null,{"$f":"IF(ISNUMBER(SEARCH(\"Scientific associations\",'Data extraction-synthesis'!M19)),\"X\",\"\")","v":""},{"$nulls":3},{"$f":"IF(ISNUMBER(SEARCH(\"Strategists\",'Data extraction-synthesis'!M19)),\"X\",\"\")","v":""},null,null,{"$f":"IF(ISNUMBER(SEARCH(\"Other\",'Data extraction-synthesis'!M19)),\"X\",\"\")","v":""}]
["PATH","Diagnostics for neglected tropical diseases: Defining the best tools through target product profiles",{"$f":"IF(ISNUMBER(SEARCH(\"Industry (unspecific)\",'Data extraction-synthesis'!M20)),\"X\",\"\")","v":"X"},7,"X","Scoping","Drafting",null,{"$f":"IF(ISNUMBER(SEARCH(\"Test developers\",'Data extraction-synthesis'!M20)),\"X\",\"\")","v":""},null,{"$f":"IF(ISNUMBER(SEARCH(\"Academia/researchers\",'Data extraction-synthesis'!M20)),\"X\",\"\")","v":"X"},"Scoping","Drafting",null,{"$f":"IF(ISNUMBER(SEARCH(\"Clinicians\",'Data extraction-synthesis'!M20)),\"X\",\"\")","v":""},{"$nulls":3},{"$f":"IF(ISNUMBER(SEARCH(\"Representatives of countries and national disease programs\",'Data extraction-synthesis'!M20)),\"X\",\"\")","v":"X"},"Scoping","Drafting",null,{"$f":"IF(ISNUMBER(SEARCH(\"International/public health institution \",'Data extraction-synthesis'!M20)),\"X\",\"\")","v":""},{"$nulls":3},{"$f":"IF(ISNUMBER(SEARCH(\"Experts (unspecific)\",'Data extraction-synthesis'!M20)),\"X\",\"\")","v":""},null,null,{"$f":"IF(ISNUMBER(SEARCH(\"Laboratory experts\",'Data extraction-synthesis'!M20)),\"X\",\"\")","v":""},null,null,{"$f":"IF(ISNUMBER(SEARCH(\"Non-profit sector\",'Data extraction-synthesis'!M20)),\"X\",\"\")","v":"X"},"Scoping","Drafting",{"$f":"IF(ISNUMBER(SEARCH(\"Technical/funding agencies\",'Data extraction-synthesis'!M20)),\"X\",\"\")","v":""},{"$nulls":3},{"$f":"IF(ISNUMBER(SEARCH(\"Policy makers\",'Data extraction-synthesis'!M20)),\"X\",\"\")","v":"X"},"Scoping","Drafting",null,{"$f":"IF(ISNUMBER(SEARCH(\"Implementers\",'Data extraction-synthesis'!M20)),\"X\",\"\")","v":""},{"$nulls":3},{"$f":"IF(ISNUMBER(SEARCH(\"Patient/community advocates\",'Data extraction-synthesis'!M20)),\"X\",\"\")","v":""},{"$nulls":3},{"$f":"IF(ISNUMBER(SEARCH(\"Microbiologists\",'Data extraction-synthesis'!M20)),\"X\",\"\")","v":""},{"$nulls":3},{"$f":"IF(ISNUMBER(SEARCH(\"Modelers\",'Data extraction-synthesis'!M20)),\"X\",\"\")","v":""},null,null,{"$f":"IF(ISNUMBER(SEARCH(\"Health economists\",'Data extraction-synthesis'!M20)),\"X\",\"\")","v":""},null,null,{"$f":"IF(ISNUMBER(SEARCH(\"Donors\",'Data extraction-synthesis'!M20)),\"X\",\"\")","v":"X"},"Scoping","Drafting",{"$f":"IF(ISNUMBER(SEARCH(\"Market experts\",'Data extraction-synthesis'!M20)),\"X\",\"\")","v":""},{"$nulls":3},{"$f":"IF(ISNUMBER(SEARCH(\"Program manager\",'Data extraction-synthesis'!M20)),\"X\",\"\")","v":""},null,null,{"$f":"IF(ISNUMBER(SEARCH(\"Scientific associations\",'Data extraction-synthesis'!M20)),\"X\",\"\")","v":""},{"$nulls":3},{"$f":"IF(ISNUMBER(SEARCH(\"Strategists\",'Data extraction-synthesis'!M20)),\"X\",\"\")","v":""},null,null,{"$f":"IF(ISNUMBER(SEARCH(\"Other\",'Data extraction-synthesis'!M20)),\"X\",\"\")","v":""}]
["PATH","Target Product Profile: Schistosomiasis Surveillance Diagnostic",{"$f":"IF(ISNUMBER(SEARCH(\"Industry (unspecific)\",'Data extraction-synthesis'!M21)),\"X\",\"\")","v":""},null,"",{"$nulls":3},{"$f":"IF(ISNUMBER(SEARCH(\"Test developers\",'Data extraction-synthesis'!M21)),\"X\",\"\")","v":""},null,{"$f":"IF(ISNUMBER(SEARCH(\"Academia/researchers\",'Data extraction-synthesis'!M21)),\"X\",\"\")","v":""},{"$nulls":3},{"$f":"IF(ISNUMBER(SEARCH(\"Clinicians\",'Data extraction-synthesis'!M21)),\"X\",\"\")","v":""},{"$nulls":3},{"$f":"IF(ISNUMBER(SEARCH(\"Representatives of countries and national disease programs\",'Data extraction-synthesis'!M21)),\"X\",\"\")","v":""},{"$nulls":3},{"$f":"IF(ISNUMBER(SEARCH(\"International/public health institution \",'Data extraction-synthesis'!M21)),\"X\",\"\")","v":""},{"$nulls":3},{"$f":"IF(ISNUMBER(SEARCH(\"Experts (unspecific)\",'Data extraction-synthesis'!M21)),\"X\",\"\")","v":""},null,null,{"$f":"IF(ISNUMBER(SEARCH(\"Laboratory experts\",'Data extraction-synthesis'!M21)),\"X\",\"\")","v":""},null,null,{"$f":"IF(ISNUMBER(SEARCH(\"Non-profit sector\",'Data extraction-synthesis'!M21)),\"X\",\"\")","v":""},null,null,{"$f":"IF(ISNUMBER(SEARCH(\"Technical/funding agencies\",'Data extraction-synthesis'!M21)),\"X\",\"\")","v":""},{"$nulls":3},{"$f":"IF(ISNUMBER(SEARCH(\"Policy makers\",'Data extraction-synthesis'!M21)),\"X\",\"\")","v":""},{"$nulls":3},{"$f":"IF(ISNUMBER(SEARCH(\"Implementers\",'Data extraction-synthesis'!M21)),\"X\",\"\")","v":""},{"$nulls":3},{"$f":"IF(ISNUMBER(SEARCH(\"Patient/community advocates\",'Data extraction-synthesis'!M21)),\"X\",\"\")","v":""},{"$nulls":3},{"$f":"IF(ISNUMBER(SEARCH(\"Microbiologists\",'Data extraction-synthesis'!M21)),\"X\",\"\")","v":""},{"$nulls":3},{"$f":"IF(ISNUMBER(SEARCH(\"Modelers\",'Data extraction-synthesis'!M21)),\"X\",\"\")","v":""},null,null,{"$f":"IF(ISNUMBER(SEARCH(\"Health economists\",'Data extraction-synthesis'!M21)),\"X\",\"\")","v":""},null,null,{"$f":"IF(ISNUMBER(SEARCH(\"Donors\",'Data extraction-synthesis'!M21)),\"X\",\"\")","v":""},null,null,{"$f":"IF(ISNUMBER(SEARCH(\"Market experts\",'Data extraction-synthesis'!M21)),\"X\",\"\")","v":""},{"$nulls":3},{"$f":"IF(ISNUMBER(SEARCH(\"Program manager\",'Data extraction-synthesis'!M21)),\"X\",\"\")","v":""},null,null,{"$f":"IF(ISNUMBER(SEARCH(\"Scientific associations\",'Data extraction-synthesis'!M21)),\"X\",\"\")","v":""},{"$nulls":3},{"$f":"IF(ISNUMBER(SEARCH(\"Strategists\",'Data extraction-synthesis'!M21)),\"X\",\"\")","v":""},null,null,{"$f":"IF(ISNUMBER(SEARCH(\"Other\",'Data extraction-synthesis'!M21)),\"X\",\"\")","v":""}]
["UNICEF","UNICEF Target Product Profile Rapid E.coli Detection (version 2.0)",{"$f":"IF(ISNUMBER(SEARCH(\"Industry (unspecific)\",'Data extraction-synthesis'!M22)),\"X\",\"\")","v":""},null,"",{"$nulls":3},{"$f":"IF(ISNUMBER(SEARCH(\"Test developers\",'Data extraction-synthesis'!M22)),\"X\",\"\")","v":""},null,{"$f":"IF(ISNUMBER(SEARCH(\"Academia/researchers\",'Data extraction-synthesis'!M22)),\"X\",\"\")","v":""},{"$nulls":3},{"$f":"IF(ISNUMBER(SEARCH(\"Clinicians\",'Data extraction-synthesis'!M22)),\"X\",\"\")","v":""},{"$nulls":3},{"$f":"IF(ISNUMBER(SEARCH(\"Representatives of countries and national disease programs\",'Data extraction-synthesis'!M22)),\"X\",\"\")","v":""},{"$nulls":3},{"$f":"IF(ISNUMBER(SEARCH(\"International/public health institution \",'Data extraction-synthesis'!M22)),\"X\",\"\")","v":""},{"$nulls":3},{"$f":"IF(ISNUMBER(SEARCH(\"Experts (unspecific)\",'Data extraction-synthesis'!M22)),\"X\",\"\")","v":""},null,null,{"$f":"IF(ISNUMBER(SEARCH(\"Laboratory experts\",'Data extraction-synthesis'!M22)),\"X\",\"\")","v":""},null,null,{"$f":"IF(ISNUMBER(SEARCH(\"Non-profit sector\",'Data extraction-synthesis'!M22)),\"X\",\"\")","v":""},null,null,{"$f":"IF(ISNUMBER(SEARCH(\"Technical/funding agencies\",'Data extraction-synthesis'!M22)),\"X\",\"\")","v":""},{"$nulls":3},{"$f":"IF(ISNUMBER(SEARCH(\"Policy makers\",'Data extraction-synthesis'!M22)),\"X\",\"\")","v":""},{"$nulls":3},{"$f":"IF(ISNUMBER(SEARCH(\"Implementers\",'Data extraction-synthesis'!M22)),\"X\",\"\")","v":""},{"$nulls":3},{"$f":"IF(ISNUMBER(SEARCH(\"Patient/community advocates\",'Data extraction-synthesis'!M22)),\"X\",\"\")","v":""},{"$nulls":3},{"$f":"IF(ISNUMBER(SEARCH(\"Microbiologists\",'Data extraction-synthesis'!M22)),\"X\",\"\")","v":""},{"$nulls":3},{"$f":"IF(ISNUMBER(SEARCH(\"Modelers\",'Data extraction-synthesis'!M22)),\"X\",\"\")","v":""},null,null,{"$f":"IF(ISNUMBER(SEARCH(\"Health economists\",'Data extraction-synthesis'!M22)),\"X\",\"\")","v":""},null,null,{"$f":"IF(ISNUMBER(SEARCH(\"Donors\",'Data extraction-synthesis'!M22)),\"X\",\"\")","v":""},null,null,{"$f":"IF(ISNUMBER(SEARCH(\"Market experts\",'Data extraction-synthesis'!M22)),\"X\",\"\")","v":""},{"$nulls":3},{"$f":"IF(ISNUMBER(SEARCH(\"Program manager\",'Data extraction-synthesis'!M22)),\"X\",\"\")","v":""},null,null,{"$f":"IF(ISNUMBER(SEARCH(\"Scientific associations\",'Data extraction-synthesis'!M22)),\"X\",\"\")","v":""},{"$nulls":3},{"$f":"IF(ISNUMBER(SEARCH(\"Strategists\",'Data extraction-synthesis'!M22)),\"X\",\"\")","v":""},null,null,{"$f":"IF(ISNUMBER(SEARCH(\"Other\",'Data extraction-synthesis'!M22)),\"X\",\"\")","v":""}]
["UNICEF","UNICEF Target Product Profile Rapid E.coli Detection (1.4)",{"$f":"IF(ISNUMBER(SEARCH(\"Industry (unspecific)\",'Data extraction-synthesis'!M23)),\"X\",\"\")","v":""},null,"",{"$nulls":3},{"$f":"IF(ISNUMBER(SEARCH(\"Test developers\",'Data extraction-synthesis'!M23)),\"X\",\"\")","v":""},null,{"$f":"IF(ISNUMBER(SEARCH(\"Academia/researchers\",'Data extraction-synthesis'!M23)),\"X\",\"\")","v":""},{"$nulls":3},{"$f":"IF(ISNUMBER(SEARCH(\"Clinicians\",'Data extraction-synthesis'!M23)),\"X\",\"\")","v":""},{"$nulls":3},{"$f":"IF(ISNUMBER(SEARCH(\"Representatives of countries and national disease programs\",'Data extraction-synthesis'!M23)),\"X\",\"\")","v":""},{"$nulls":3},{"$f":"IF(ISNUMBER(SEARCH(\"International/public health institution \",'Data extraction-synthesis'!M23)),\"X\",\"\")","v":""},{"$nulls":3},{"$f":"IF(ISNUMBER(SEARCH(\"Experts (unspecific)\",'Data extraction-synthesis'!M23)),\"X\",\"\")","v":""},null,null,{"$f":"IF(ISNUMBER(SEARCH(\"Laboratory experts\",'Data extraction-synthesis'!M23)),\"X\",\"\")","v":""},null,null,{"$f":"IF(ISNUMBER(SEARCH(\"Non-profit sector\",'Data extraction-synthesis'!M23)),\"X\",\"\")","v":""},null,null,{"$f":"IF(ISNUMBER(SEARCH(\"Technical/funding agencies\",'Data extraction-synthesis'!M23)),\"X\",\"\")","v":""},{"$nulls":3},{"$f":"IF(ISNUMBER(SEARCH(\"Policy makers\",'Data extraction-synthesis'!M23)),\"X\",\"\")","v":""},{"$nulls":3},{"$f":"IF(ISNUMBER(SEARCH(\"Implementers\",'Data extraction-synthesis'!M23)),\"X\",\"\")","v":""},{"$nulls":3},{"$f":"IF(ISNUMBER(SEARCH(\"Patient/community advocates\",'Data extraction-synthesis'!M23)),\"X\",\"\")","v":""},{"$nulls":3},{"$f":"IF(ISNUMBER(SEARCH(\"Microbiologists\",'Data extraction-synthesis'!M23)),\"X\",\"\")","v":""},{"$nulls":3},{"$f":"IF(ISNUMBER(SEARCH(\"Modelers\",'Data extraction-synthesis'!M23)),\"X\",\"\")","v":""},null,null,{"$f":"IF(ISNUMBER(SEARCH(\"Health economists\",'Data extraction-synthesis'!M23)),\"X\",\"\")","v":""},null,null,{"$f":"IF(ISNUMBER(SEARCH(\"Donors\",'Data extraction-synthesis'!M23)),\"X\",\"\")","v":""},null,null,{"$f":"IF(ISNUMBER(SEARCH(\"Market experts\",'Data extraction-synthesis'!M23)),\"X\",\"\")","v":""},{"$nulls":3},{"$f":"IF(ISNUMBER(SEARCH(\"Program manager\",'Data extraction-synthesis'!M23)),\"X\",\"\")","v":""},null,null,{"$f":"IF(ISNUMBER(SEARCH(\"Scientific associations\",'Data extraction-synthesis'!M23)),\"X\",\"\")","v":""},{"$nulls":3},{"$f":"IF(ISNUMBER(SEARCH(\"Strategists\",'Data extraction-synthesis'!M23)),\"X\",\"\")","v":""},null,null,{"$f":"IF(ISNUMBER(SEARCH(\"Other\",'Data extraction-synthesis'!M23)),\"X\",\"\")","v":""}]
["WHO","High-priority target product profile for new tubercolosis diagnostics: report of a consensus meeting",{"$f":"IF(ISNUMBER(SEARCH(\"Industry (unspecific)\",'Data extraction-synthesis'!M24)),\"X\",\"\")","v":"X"},null,"X","Consensus-building",null,null,{"$f":"IF(ISNUMBER(SEARCH(\"Test developers\",'Data extraction-synthesis'!M24)),\"X\",\"\")","v":""},null,{"$f":"IF(ISNUMBER(SEARCH(\"Academia/researchers\",'Data extraction-synthesis'!M24)),\"X\",\"\")","v":"X"},"Drafting","Consensus-building",null,{"$f":"IF(ISNUMBER(SEARCH(\"Clinicians\",'Data extraction-synthesis'!M24)),\"X\",\"\")","v":"X"},"Consensus-building",null,null,{"$f":"IF(ISNUMBER(SEARCH(\"Representatives of countries and national disease programs\",'Data extraction-synthesis'!M24)),\"X\",\"\")","v":"X"},"Drafting","Consensus-building",null,{"$f":"IF(ISNUMBER(SEARCH(\"International/public health institution \",'Data extraction-synthesis'!M24)),\"X\",\"\")","v":"X"},"Consensus-building","Drafting",null,{"$f":"IF(ISNUMBER(SEARCH(\"Experts (unspecific)\",'Data extraction-synthesis'!M24)),\"X\",\"\")","v":""},null,null,{"$f":"IF(ISNUMBER(SEARCH(\"Laboratory experts\",'Data extraction-synthesis'!M24)),\"X\",\"\")","v":""},null,null,{"$f":"IF(ISNUMBER(SEARCH(\"Non-profit sector\",'Data extraction-synthesis'!M24)),\"X\",\"\")","v":""},null,null,{"$f":"IF(ISNUMBER(SEARCH(\"Technical/funding agencies\",'Data extraction-synthesis'!M24)),\"X\",\"\")","v":"X"},"Consensus-building",null,null,{"$f":"IF(ISNUMBER(SEARCH(\"Policy makers\",'Data extraction-synthesis'!M24)),\"X\",\"\")","v":""},{"$nulls":3},{"$f":"IF(ISNUMBER(SEARCH(\"Implementers\",'Data extraction-synthesis'!M24)),\"X\",\"\")","v":"X"},"Consensus-building",null,null,{"$f":"IF(ISNUMBER(SEARCH(\"Patient/community advocates\",'Data extraction-synthesis'!M24)),\"X\",\"\")","v":""},{"$nulls":3},{"$f":"IF(ISNUMBER(SEARCH(\"Microbiologists\",'Data extraction-synthesis'!M24)),\"X\",\"\")","v":""},{"$nulls":3},{"$f":"IF(ISNUMBER(SEARCH(\"Modelers\",'Data extraction-synthesis'!M24)),\"X\",\"\")","v":""},null,null,{"$f":"IF(ISNUMBER(SEARCH(\"Health economists\",'Data extraction-synthesis'!M24)),\"X\",\"\")","v":""},null,null,{"$f":"IF(ISNUMBER(SEARCH(\"Donors\",'Data extraction-synthesis'!M24)),\"X\",\"\")","v":"X"},"Consensus-building",null,{"$f":"IF(ISNUMBER(SEARCH(\"Market experts\",'Data extraction-synthesis'!M24)),\"X\",\"\")","v":""},{"$nulls":3},{"$f":"IF(ISNUMBER(SEARCH(\"Program manager\",'Data extraction-synthesis'!M24)),\"X\",\"\")","v":""},null,null,{"$f":"IF(ISNUMBER(SEARCH(\"Scientific associations\",'Data extraction-synthesis'!M24)),\"X\",\"\")","v":""},{"$nulls":3},{"$f":"IF(ISNUMBER(SEARCH(\"Strategists\",'Data extraction-synthesis'!M24)),\"X\",\"\")","v":""},null,null,{"$f":"IF(ISNUMBER(SEARCH(\"Other\",'Data extraction-synthesis'!M24)),\"X\",\"\")","v":""}]
["WHO","Development of a Target Product Profile (TPP) and framework for evaluation for a test predicting progression from tubercolosis infection to active disease",{"$f":"IF(ISNUMBER(SEARCH(\"Industry (unspecific)\",'Data extraction-synthesis'!M25)),\"X\",\"\")","v":""},null,"X","Consensus-building",null,null,{"$f":"IF(ISNUMBER(SEARCH(\"Test developers\",'Data extraction-synthesis'!M25)),\"X\",\"\")","v":"X"},null,{"$f":"IF(ISNUMBER(SEARCH(\"Academia/researchers\",'Data extraction-synthesis'!M25)),\"X\",\"\")","v":"X"},"Consensus-building","Drafting",null,{"$f":"IF(ISNUMBER(SEARCH(\"Clinicians\",'Data extraction-synthesis'!M25)),\"X\",\"\")","v":""},{"$nulls":3},{"$f":"IF(ISNUMBER(SEARCH(\"Representatives of countries and national disease programs\",'Data extraction-synthesis'!M25)),\"X\",\"\")","v":"X"},"Consensus-building",null,null,{"$f":"IF(ISNUMBER(SEARCH(\"International/public health institution \",'Data extraction-synthesis'!M25)),\"X\",\"\")","v":"X"},"Consensus-building","Drafting",null,{"$f":"IF(ISNUMBER(SEARCH(\"Experts (unspecific)\",'Data extraction-synthesis'!M25)),\"X\",\"\")","v":""},null,null,{"$f":"IF(ISNUMBER(SEARCH(\"Laboratory experts\",'Data extraction-synthesis'!M25)),\"X\",\"\")","v":""},null,null,{"$f":"IF(ISNUMBER(SEARCH(\"Non-profit sector\",'Data extraction-synthesis'!M25)),\"X\",\"\")","v":"X"},"Consensus-building",null,{"$f":"IF(ISNUMBER(SEARCH(\"Technical/funding agencies\",'Data extraction-synthesis'!M25)),\"X\",\"\")","v":"X"},"Consensus-building",null,null,{"$f":"IF(ISNUMBER(SEARCH(\"Policy makers\",'Data extraction-synthesis'!M25)),\"X\",\"\")","v":""},{"$nulls":3},{"$f":"IF(ISNUMBER(SEARCH(\"Implementers\",'Data extraction-synthesis'!M25)),\"X\",\"\")","v":""},{"$nulls":3},{"$f":"IF(ISNUMBER(SEARCH(\"Patient/community advocates\",'Data extraction-synthesis'!M25)),\"X\",\"\")","v":"X"},"Consensus-building",null,null,{"$f":"IF(ISNUMBER(SEARCH(\"Microbiologists\",'Data extraction-synthesis'!M25)),\"X\",\"\")","v":""},{"$nulls":3},{"$f":"IF(ISNUMBER(SEARCH(\"Modelers\",'Data extraction-synthesis'!M25)),\"X\",\"\")","v":""},null,null,{"$f":"IF(ISNUMBER(SEARCH(\"Health economists\",'Data extraction-synthesis'!M25)),\"X\",\"\")","v":""},null,null,"x","Drafting",null,{"$f":"IF(ISNUMBER(SEARCH(\"Market experts\",'Data extraction-synthesis'!M25)),\"X\",\"\")","v":""},{"$nulls":3},{"$f":"IF(ISNUMBER(SEARCH(\"Program manager\",'Data extraction-synthesis'!M25)),\"X\",\"\")","v":""},null,null,{"$f":"IF(ISNUMBER(SEARCH(\"Scientific associations\",'Data extraction-synthesis'!M25)),\"X\",\"\")","v":"X"},"Consensus-building","Drafting",null,{"$f":"IF(ISNUMBER(SEARCH(\"Strategists\",'Data extraction-synthesis'!M25)),\"X\",\"\")","v":""},null,null,{"$f":"IF(ISNUMBER(SEARCH(\"Other\",'Data extraction-synthesis'!M25)),\"X\",\"\")","v":""}]
["WHO","Specifications for a rapid diagnostic test for meningitis African meningitis belt/ Target product profile for the development of a new generation of rapid test for the diagnosis of bacterial meningitis",{"$f":"IF(ISNUMBER(SEARCH(\"Industry (unspecific)\",'Data extraction-synthesis'!M26)),\"X\",\"\")","v":""},null,"",{"$nulls":3},{"$f":"IF(ISNUMBER(SEARCH(\"Test developers\",'Data extraction-synthesis'!M26)),\"X\",\"\")","v":""},null,{"$f":"IF(ISNUMBER(SEARCH(\"Academia/researchers\",'Data extraction-synthesis'!M26)),\"X\",\"\")","v":""},{"$nulls":3},{"$f":"IF(ISNUMBER(SEARCH(\"Clinicians\",'Data extraction-synthesis'!M26)),\"X\",\"\")","v":""},{"$nulls":3},{"$f":"IF(ISNUMBER(SEARCH(\"Representatives of countries and national disease programs\",'Data extraction-synthesis'!M26)),\"X\",\"\")","v":""},{"$nulls":3},{"$f":"IF(ISNUMBER(SEARCH(\"International/public health institution \",'Data extraction-synthesis'!M26)),\"X\",\"\")","v":""},{"$nulls":3},{"$f":"IF(ISNUMBER(SEARCH(\"Experts (unspecific)\",'Data extraction-synthesis'!M26)),\"X\",\"\")","v":""},null,null,{"$f":"IF(ISNUMBER(SEARCH(\"Laboratory experts\",'Data extraction-synthesis'!M26)),\"X\",\"\")","v":""},null,null,{"$f":"IF(ISNUMBER(SEARCH(\"Non-profit sector\",'Data extraction-synthesis'!M26)),\"X\",\"\")","v":""},null,null,{"$f":"IF(ISNUMBER(SEARCH(\"Technical/funding agencies\",'Data extraction-synthesis'!M26)),\"X\",\"\")","v":""},{"$nulls":3},{"$f":"IF(ISNUMBER(SEARCH(\"Policy makers\",'Data extraction-synthesis'!M26)),\"X\",\"\")","v":""},{"$nulls":3},{"$f":"IF(ISNUMBER(SEARCH(\"Implementers\",'Data extraction-synthesis'!M26)),\"X\",\"\")","v":""},{"$nulls":3},{"$f":"IF(ISNUMBER(SEARCH(\"Patient/community advocates\",'Data extraction-synthesis'!M26)),\"X\",\"\")","v":""},{"$nulls":3},{"$f":"IF(ISNUMBER(SEARCH(\"Microbiologists\",'Data extraction-synthesis'!M26)),\"X\",\"\")","v":""},{"$nulls":3},{"$f":"IF(ISNUMBER(SEARCH(\"Modelers\",'Data extraction-synthesis'!M26)),\"X\",\"\")","v":""},null,null,{"$f":"IF(ISNUMBER(SEARCH(\"Health economists\",'Data extraction-synthesis'!M26)),\"X\",\"\")","v":""},null,null,{"$f":"IF(ISNUMBER(SEARCH(\"Donors\",'Data extraction-synthesis'!M26)),\"X\",\"\")","v":""},null,null,{"$f":"IF(ISNUMBER(SEARCH(\"Market experts\",'Data extraction-synthesis'!M26)),\"X\",\"\")","v":""},{"$nulls":3},{"$f":"IF(ISNUMBER(SEARCH(\"Program manager\",'Data extraction-synthesis'!M26)),\"X\",\"\")","v":""},null,null,{"$f":"IF(ISNUMBER(SEARCH(\"Scientific associations\",'Data extraction-synthesis'!M26)),\"X\",\"\")","v":""},{"$nulls":3},{"$f":"IF(ISNUMBER(SEARCH(\"Strategists\",'Data extraction-synthesis'!M26)),\"X\",\"\")","v":""},null,null,{"$f":"IF(ISNUMBER(SEARCH(\"Other\",'Data extraction-synthesis'!M26)),\"X\",\"\")","v":""}]
["WHO","Target Product Profile for Zaire ebolavirus rapid,simple test to be used in the control of the Ebola outbreak in West Africa",{"$f":"IF(ISNUMBER(SEARCH(\"Industry (unspecific)\",'Data extraction-synthesis'!M27)),\"X\",\"\")","v":""},null,"",{"$nulls":3},{"$f":"IF(ISNUMBER(SEARCH(\"Test developers\",'Data extraction-synthesis'!M27)),\"X\",\"\")","v":""},null,{"$f":"IF(ISNUMBER(SEARCH(\"Academia/researchers\",'Data extraction-synthesis'!M27)),\"X\",\"\")","v":""},{"$nulls":3},{"$f":"IF(ISNUMBER(SEARCH(\"Clinicians\",'Data extraction-synthesis'!M27)),\"X\",\"\")","v":""},{"$nulls":3},{"$f":"IF(ISNUMBER(SEARCH(\"Representatives of countries and national disease programs\",'Data extraction-synthesis'!M27)),\"X\",\"\")","v":""},{"$nulls":3},{"$f":"IF(ISNUMBER(SEARCH(\"International/public health institution \",'Data extraction-synthesis'!M27)),\"X\",\"\")","v":"X"},"Drafting",null,null,{"$f":"IF(ISNUMBER(SEARCH(\"Experts (unspecific)\",'Data extraction-synthesis'!M27)),\"X\",\"\")","v":""},null,null,{"$f":"IF(ISNUMBER(SEARCH(\"Laboratory experts\",'Data extraction-synthesis'!M27)),\"X\",\"\")","v":""},null,null,{"$f":"IF(ISNUMBER(SEARCH(\"Non-profit sector\",'Data extraction-synthesis'!M27)),\"X\",\"\")","v":"X"},"Drafting",null,{"$f":"IF(ISNUMBER(SEARCH(\"Technical/funding agencies\",'Data extraction-synthesis'!M27)),\"X\",\"\")","v":""},{"$nulls":3},{"$f":"IF(ISNUMBER(SEARCH(\"Policy makers\",'Data extraction-synthesis'!M27)),\"X\",\"\")","v":""},{"$nulls":3},{"$f":"IF(ISNUMBER(SEARCH(\"Implementers\",'Data extraction-synthesis'!M27)),\"X\",\"\")","v":""},{"$nulls":3},{"$f":"IF(ISNUMBER(SEARCH(\"Patient/community advocates\",'Data extraction-synthesis'!M27)),\"X\",\"\")","v":""},{"$nulls":3},{"$f":"IF(ISNUMBER(SEARCH(\"Microbiologists\",'Data extraction-synthesis'!M27)),\"X\",\"\")","v":""},{"$nulls":3},{"$f":"IF(ISNUMBER(SEARCH(\"Modelers\",'Data extraction-synthesis'!M27)),\"X\",\"\")","v":""},null,null,{"$f":"IF(ISNUMBER(SEARCH(\"Health economists\",'Data extraction-synthesis'!M27)),\"X\",\"\")","v":""},null,null,{"$f":"IF(ISNUMBER(SEARCH(\"Donors\",'Data extraction-synthesis'!M27)),\"X\",\"\")","v":""},null,null,{"$f":"IF(ISNUMBER(SEARCH(\"Market experts\",'Data extraction-synthesis'!M27)),\"X\",\"\")","v":""},{"$nulls":3},{"$f":"IF(ISNUMBER(SEARCH(\"Program manager\",'Data extraction-synthesis'!M27)),\"X\",\"\")","v":""},null,null,{"$f":"IF(ISNUMBER(SEARCH(\"Scientific associations\",'Data extraction-synthesis'!M27)),\"X\",\"\")","v":""},{"$nulls":3},{"$f":"IF(ISNUMBER(SEARCH(\"Strategists\",'Data extraction-synthesis'!M27)),\"X\",\"\")","v":""},null,null,{"$f":"IF(ISNUMBER(SEARCH(\"Other\",'Data extraction-synthesis'!M27)),\"X\",\"\")","v":""}]
["WHO","Report of WHO-FIND meeting on diagnostics for Buruli ulcer",{"$f":"IF(ISNUMBER(SEARCH(\"Industry (unspecific)\",'Data extraction-synthesis'!M28)),\"X\",\"\")","v":""},null,"",{"$nulls":3},{"$f":"IF(ISNUMBER(SEARCH(\"Test developers\",'Data extraction-synthesis'!M28)),\"X\",\"\")","v":""},null,{"$f":"IF(ISNUMBER(SEARCH(\"Academia/researchers\",'Data extraction-synthesis'!M28)),\"X\",\"\")","v":"X"},"Scoping","Drafting",null,{"$f":"IF(ISNUMBER(SEARCH(\"Clinicians\",'Data extraction-synthesis'!M28)),\"X\",\"\")","v":"X"},"Scoping","Drafting",null,{"$f":"IF(ISNUMBER(SEARCH(\"Representatives of countries and national disease programs\",'Data extraction-synthesis'!M28)),\"X\",\"\")","v":""},{"$nulls":3},{"$f":"IF(ISNUMBER(SEARCH(\"International/public health institution \",'Data extraction-synthesis'!M28)),\"X\",\"\")","v":"X"},"Scoping","Drafting",null,{"$f":"IF(ISNUMBER(SEARCH(\"Experts (unspecific)\",'Data extraction-synthesis'!M28)),\"X\",\"\")","v":""},null,null,{"$f":"IF(ISNUMBER(SEARCH(\"Laboratory experts\",'Data extraction-synthesis'!M28)),\"X\",\"\")","v":""},null,null,{"$f":"IF(ISNUMBER(SEARCH(\"Non-profit sector\",'Data extraction-synthesis'!M28)),\"X\",\"\")","v":""},null,null,{"$f":"IF(ISNUMBER(SEARCH(\"Technical/funding agencies\",'Data extraction-synthesis'!M28)),\"X\",\"\")","v":""},{"$nulls":3},{"$f":"IF(ISNUMBER(SEARCH(\"Policy makers\",'Data extraction-synthesis'!M28)),\"X\",\"\")","v":"X"},"Scoping","Drafting",null,{"$f":"IF(ISNUMBER(SEARCH(\"Implementers\",'Data extraction-synthesis'!M28)),\"X\",\"\")","v":""},{"$nulls":3},{"$f":"IF(ISNUMBER(SEARCH(\"Patient/community advocates\",'Data extraction-synthesis'!M28)),\"X\",\"\")","v":""},{"$nulls":3},{"$f":"IF(ISNUMBER(SEARCH(\"Microbiologists\",'Data extraction-synthesis'!M28)),\"X\",\"\")","v":""},{"$nulls":3},{"$f":"IF(ISNUMBER(SEARCH(\"Modelers\",'Data extraction-synthesis'!M28)),\"X\",\"\")","v":""},null,null,{"$f":"IF(ISNUMBER(SEARCH(\"Health economists\",'Data extraction-synthesis'!M28)),\"X\",\"\")","v":""},null,null,{"$f":"IF(ISNUMBER(SEARCH(\"Donors\",'Data extraction-synthesis'!M28)),\"X\",\"\")","v":""},null,null,{"$f":"IF(ISNUMBER(SEARCH(\"Market experts\",'Data extraction-synthesis'!M28)),\"X\",\"\")","v":""},{"$nulls":3},{"$f":"IF(ISNUMBER(SEARCH(\"Program manager\",'Data extraction-synthesis'!M28)),\"X\",\"\")","v":""},null,null,{"$f":"IF(ISNUMBER(SEARCH(\"Scientific associations\",'Data extraction-synthesis'!M28)),\"X\",\"\")","v":""},{"$nulls":3},{"$f":"IF(ISNUMBER(SEARCH(\"Strategists\",'Data extraction-synthesis'!M28)),\"X\",\"\")","v":""},null,null,{"$f":"IF(ISNUMBER(SEARCH(\"Other\",'Data extraction-synthesis'!M28)),\"X\",\"\")","v":""}]
["WHO","Taenia solium taeniasis/cysticercosis diagnostic tools. Report of a stakeholder meeting",{"$f":"IF(ISNUMBER(SEARCH(\"Industry (unspecific)\",'Data extraction-synthesis'!M29)),\"X\",\"\")","v":""},null,"",{"$nulls":3},{"$f":"IF(ISNUMBER(SEARCH(\"Test developers\",'Data extraction-synthesis'!M29)),\"X\",\"\")","v":""},null,{"$f":"IF(ISNUMBER(SEARCH(\"Academia/researchers\",'Data extraction-synthesis'!M29)),\"X\",\"\")","v":"X"},"Scoping",null,null,{"$f":"IF(ISNUMBER(SEARCH(\"Clinicians\",'Data extraction-synthesis'!M29)),\"X\",\"\")","v":""},{"$nulls":3},{"$f":"IF(ISNUMBER(SEARCH(\"Representatives of countries and national disease programs\",'Data extraction-synthesis'!M29)),\"X\",\"\")","v":""},{"$nulls":3},{"$f":"IF(ISNUMBER(SEARCH(\"International/public health institution \",'Data extraction-synthesis'!M29)),\"X\",\"\")","v":"X"},"Scoping",null,null,{"$f":"IF(ISNUMBER(SEARCH(\"Experts (unspecific)\",'Data extraction-synthesis'!M29)),\"X\",\"\")","v":""},null,null,{"$f":"IF(ISNUMBER(SEARCH(\"Laboratory experts\",'Data extraction-synthesis'!M29)),\"X\",\"\")","v":""},null,null,{"$f":"IF(ISNUMBER(SEARCH(\"Non-profit sector\",'Data extraction-synthesis'!M29)),\"X\",\"\")","v":""},null,null,{"$f":"IF(ISNUMBER(SEARCH(\"Technical/funding agencies\",'Data extraction-synthesis'!M29)),\"X\",\"\")","v":""},{"$nulls":3},{"$f":"IF(ISNUMBER(SEARCH(\"Policy makers\",'Data extraction-synthesis'!M29)),\"X\",\"\")","v":""},{"$nulls":3},{"$f":"IF(ISNUMBER(SEARCH(\"Implementers\",'Data extraction-synthesis'!M29)),\"X\",\"\")","v":""},{"$nulls":3},{"$f":"IF(ISNUMBER(SEARCH(\"Patient/community advocates\",'Data extraction-synthesis'!M29)),\"X\",\"\")","v":""},{"$nulls":3},{"$f":"IF(ISNUMBER(SEARCH(\"Microbiologists\",'Data extraction-synthesis'!M29)),\"X\",\"\")","v":""},{"$nulls":3},{"$f":"IF(ISNUMBER(SEARCH(\"Modelers\",'Data extraction-synthesis'!M29)),\"X\",\"\")","v":""},null,null,{"$f":"IF(ISNUMBER(SEARCH(\"Health economists\",'Data extraction-synthesis'!M29)),\"X\",\"\")","v":""},null,null,{"$f":"IF(ISNUMBER(SEARCH(\"Donors\",'Data extraction-synthesis'!M29)),\"X\",\"\")","v":""},null,null,{"$f":"IF(ISNUMBER(SEARCH(\"Market experts\",'Data extraction-synthesis'!M29)),\"X\",\"\")","v":""},{"$nulls":3},{"$f":"IF(ISNUMBER(SEARCH(\"Program manager\",'Data extraction-synthesis'!M29)),\"X\",\"\")","v":""},null,null,{"$f":"IF(ISNUMBER(SEARCH(\"Scientific associations\",'Data extraction-synthesis'!M29)),\"X\",\"\")","v":""},{"$nulls":3},{"$f":"IF(ISNUMBER(SEARCH(\"Strategists\",'Data extraction-synthesis'!M29)),\"X\",\"\")","v":""},null,null,{"$f":"IF(ISNUMBER(SEARCH(\"Other\",'Data extraction-synthesis'!M29)),\"X\",\"\")","v":""}]
["Utzinger, J. B., S. L.: van Lieshout, L.: van Dam, G. J.: Knopp, S","New diagnostic tools in schistosomiasis",{"$f":"IF(ISNUMBER(SEARCH(\"Industry (unspecific)\",'Data extraction-synthesis'!M30)),\"X\",\"\")","v":""},null,"",{"$nulls":3},{"$f":"IF(ISNUMBER(SEARCH(\"Test developers\",'Data extraction-synthesis'!M30)),\"X\",\"\")","v":""},null,{"$f":"IF(ISNUMBER(SEARCH(\"Academia/researchers\",'Data extraction-synthesis'!M30)),\"X\",\"\")","v":""},{"$nulls":3},{"$f":"IF(ISNUMBER(SEARCH(\"Clinicians\",'Data extraction-synthesis'!M30)),\"X\",\"\")","v":""},{"$nulls":3},{"$f":"IF(ISNUMBER(SEARCH(\"Representatives of countries and national disease programs\",'Data extraction-synthesis'!M30)),\"X\",\"\")","v":""},{"$nulls":3},{"$f":"IF(ISNUMBER(SEARCH(\"International/public health institution \",'Data extraction-synthesis'!M30)),\"X\",\"\")","v":""},{"$nulls":3},{"$f":"IF(ISNUMBER(SEARCH(\"Experts (unspecific)\",'Data extraction-synthesis'!M30)),\"X\",\"\")","v":""},null,null,{"$f":"IF(ISNUMBER(SEARCH(\"Laboratory experts\",'Data extraction-synthesis'!M30)),\"X\",\"\")","v":""},null,null,{"$f":"IF(ISNUMBER(SEARCH(\"Non-profit sector\",'Data extraction-synthesis'!M30)),\"X\",\"\")","v":""},null,null,{"$f":"IF(ISNUMBER(SEARCH(\"Technical/funding agencies\",'Data extraction-synthesis'!M30)),\"X\",\"\")","v":""},{"$nulls":3},{"$f":"IF(ISNUMBER(SEARCH(\"Policy makers\",'Data extraction-synthesis'!M30)),\"X\",\"\")","v":""},{"$nulls":3},{"$f":"IF(ISNUMBER(SEARCH(\"Implementers\",'Data extraction-synthesis'!M30)),\"X\",\"\")","v":""},{"$nulls":3},{"$f":"IF(ISNUMBER(SEARCH(\"Patient/community advocates\",'Data extraction-synthesis'!M30)),\"X\",\"\")","v":""},{"$nulls":3},{"$f":"IF(ISNUMBER(SEARCH(\"Microbiologists\",'Data extraction-synthesis'!M30)),\"X\",\"\")","v":""},{"$nulls":3},{"$f":"IF(ISNUMBER(SEARCH(\"Modelers\",'Data extraction-synthesis'!M30)),\"X\",\"\")","v":""},null,null,{"$f":"IF(ISNUMBER(SEARCH(\"Health economists\",'Data extraction-synthesis'!M30)),\"X\",\"\")","v":""},null,null,{"$f":"IF(ISNUMBER(SEARCH(\"Donors\",'Data extraction-synthesis'!M30)),\"X\",\"\")","v":""},null,null,{"$f":"IF(ISNUMBER(SEARCH(\"Market experts\",'Data extraction-synthesis'!M30)),\"X\",\"\")","v":""},{"$nulls":3},{"$f":"IF(ISNUMBER(SEARCH(\"Program manager\",'Data extraction-synthesis'!M30)),\"X\",\"\")","v":""},null,null,{"$f":"IF(ISNUMBER(SEARCH(\"Scientific associations\",'Data extraction-synthesis'!M30)),\"X\",\"\")","v":""},{"$nulls":3},{"$f":"IF(ISNUMBER(SEARCH(\"Strategists\",'Data extraction-synthesis'!M30)),\"X\",\"\")","v":""},null,null,{"$f":"IF(ISNUMBER(SEARCH(\"Other\",'Data extraction-synthesis'!M30)),\"X\",\"\")","v":""}]
["UNICEF","Zika Virus Diagnostics: Target Product Profiles & Supply Update",{"$f":"IF(ISNUMBER(SEARCH(\"Industry (unspecific)\",'Data extraction-synthesis'!M31)),\"X\",\"\")","v":"X"},8,"X","Scoping","Drafting",null,{"$f":"IF(ISNUMBER(SEARCH(\"Test developers\",'Data extraction-synthesis'!M31)),\"X\",\"\")","v":""},null,{"$f":"IF(ISNUMBER(SEARCH(\"Academia/researchers\",'Data extraction-synthesis'!M31)),\"X\",\"\")","v":"X"},"Scoping","Drafting",null,{"$f":"IF(ISNUMBER(SEARCH(\"Clinicians\",'Data extraction-synthesis'!M31)),\"X\",\"\")","v":""},{"$nulls":3},{"$f":"IF(ISNUMBER(SEARCH(\"Representatives of countries and national disease programs\",'Data extraction-synthesis'!M31)),\"X\",\"\")","v":""},{"$nulls":3},{"$f":"IF(ISNUMBER(SEARCH(\"International/public health institution \",'Data extraction-synthesis'!M31)),\"X\",\"\")","v":"X"},"Scoping","Drafting",null,{"$f":"IF(ISNUMBER(SEARCH(\"Experts (unspecific)\",'Data extraction-synthesis'!M31)),\"X\",\"\")","v":""},null,null,{"$f":"IF(ISNUMBER(SEARCH(\"Laboratory experts\",'Data extraction-synthesis'!M31)),\"X\",\"\")","v":""},null,null,{"$f":"IF(ISNUMBER(SEARCH(\"Non-profit sector\",'Data extraction-synthesis'!M31)),\"X\",\"\")","v":""},null,null,{"$f":"IF(ISNUMBER(SEARCH(\"Technical/funding agencies\",'Data extraction-synthesis'!M31)),\"X\",\"\")","v":""},{"$nulls":3},{"$f":"IF(ISNUMBER(SEARCH(\"Policy makers\",'Data extraction-synthesis'!M31)),\"X\",\"\")","v":""},{"$nulls":3},{"$f":"IF(ISNUMBER(SEARCH(\"Implementers\",'Data extraction-synthesis'!M31)),\"X\",\"\")","v":""},{"$nulls":3},{"$f":"IF(ISNUMBER(SEARCH(\"Patient/community advocates\",'Data extraction-synthesis'!M31)),\"X\",\"\")","v":""},{"$nulls":3},{"$f":"IF(ISNUMBER(SEARCH(\"Microbiologists\",'Data extraction-synthesis'!M31)),\"X\",\"\")","v":""},{"$nulls":3},{"$f":"IF(ISNUMBER(SEARCH(\"Modelers\",'Data extraction-synthesis'!M31)),\"X\",\"\")","v":""},null,null,{"$f":"IF(ISNUMBER(SEARCH(\"Health economists\",'Data extraction-synthesis'!M31)),\"X\",\"\")","v":""},null,null,{"$f":"IF(ISNUMBER(SEARCH(\"Donors\",'Data extraction-synthesis'!M31)),\"X\",\"\")","v":""},null,null,{"$f":"IF(ISNUMBER(SEARCH(\"Market experts\",'Data extraction-synthesis'!M31)),\"X\",\"\")","v":""},{"$nulls":3},{"$f":"IF(ISNUMBER(SEARCH(\"Program manager\",'Data extraction-synthesis'!M31)),\"X\",\"\")","v":""},null,null,{"$f":"IF(ISNUMBER(SEARCH(\"Scientific associations\",'Data extraction-synthesis'!M31)),\"X\",\"\")","v":""},{"$nulls":3},{"$f":"IF(ISNUMBER(SEARCH(\"Strategists\",'Data extraction-synthesis'!M31)),\"X\",\"\")","v":""},null,null,{"$f":"IF(ISNUMBER(SEARCH(\"Other\",'Data extraction-synthesis'!M31)),\"X\",\"\")","v":""}]
["UNICEF","Pneumonia Acute Respiratory Infection Diagnostic Aid-Target Product Profile Introduction",{"$f":"IF(ISNUMBER(SEARCH(\"Industry (unspecific)\",'Data extraction-synthesis'!M32)),\"X\",\"\")","v":"X"},9,"X","Scoping","Drafting","Consensus-building",{"$f":"IF(ISNUMBER(SEARCH(\"Test developers\",'Data extraction-synthesis'!M32)),\"X\",\"\")","v":""},null,{"$f":"IF(ISNUMBER(SEARCH(\"Academia/researchers\",'Data extraction-synthesis'!M32)),\"X\",\"\")","v":"X"},"Scoping","Drafting","Consensus-building",{"$f":"IF(ISNUMBER(SEARCH(\"Clinicians\",'Data extraction-synthesis'!M32)),\"X\",\"\")","v":""},{"$nulls":3},{"$f":"IF(ISNUMBER(SEARCH(\"Representatives of countries and national disease programs\",'Data extraction-synthesis'!M32)),\"X\",\"\")","v":""},{"$nulls":3},{"$f":"IF(ISNUMBER(SEARCH(\"International/public health institution \",'Data extraction-synthesis'!M32)),\"X\",\"\")","v":"X"},"Scoping","Drafting","Consensus-building",{"$f":"IF(ISNUMBER(SEARCH(\"Experts (unspecific)\",'Data extraction-synthesis'!M32)),\"X\",\"\")","v":""},null,null,{"$f":"IF(ISNUMBER(SEARCH(\"Laboratory experts\",'Data extraction-synthesis'!M32)),\"X\",\"\")","v":""},null,null,{"$f":"IF(ISNUMBER(SEARCH(\"Non-profit sector\",'Data extraction-synthesis'!M32)),\"X\",\"\")","v":""},null,null,{"$f":"IF(ISNUMBER(SEARCH(\"Technical/funding agencies\",'Data extraction-synthesis'!M32)),\"X\",\"\")","v":""},{"$nulls":3},{"$f":"IF(ISNUMBER(SEARCH(\"Policy makers\",'Data extraction-synthesis'!M32)),\"X\",\"\")","v":""},{"$nulls":3},{"$f":"IF(ISNUMBER(SEARCH(\"Implementers\",'Data extraction-synthesis'!M32)),\"X\",\"\")","v":""},{"$nulls":3},{"$f":"IF(ISNUMBER(SEARCH(\"Patient/community advocates\",'Data extraction-synthesis'!M32)),\"X\",\"\")","v":""},{"$nulls":3},{"$f":"IF(ISNUMBER(SEARCH(\"Microbiologists\",'Data extraction-synthesis'!M32)),\"X\",\"\")","v":""},{"$nulls":3},{"$f":"IF(ISNUMBER(SEARCH(\"Modelers\",'Data extraction-synthesis'!M32)),\"X\",\"\")","v":""},null,null,{"$f":"IF(ISNUMBER(SEARCH(\"Health economists\",'Data extraction-synthesis'!M32)),\"X\",\"\")","v":""},null,null,{"$f":"IF(ISNUMBER(SEARCH(\"Donors\",'Data extraction-synthesis'!M32)),\"X\",\"\")","v":""},null,null,{"$f":"IF(ISNUMBER(SEARCH(\"Market experts\",'Data extraction-synthesis'!M32)),\"X\",\"\")","v":""},{"$nulls":3},{"$f":"IF(ISNUMBER(SEARCH(\"Program manager\",'Data extraction-synthesis'!M32)),\"X\",\"\")","v":""},null,null,{"$f":"IF(ISNUMBER(SEARCH(\"Scientific associations\",'Data extraction-synthesis'!M32)),\"X\",\"\")","v":""},{"$nulls":3},{"$f":"IF(ISNUMBER(SEARCH(\"Strategists\",'Data extraction-synthesis'!M32)),\"X\",\"\")","v":""},null,null,{"$f":"IF(ISNUMBER(SEARCH(\"Other\",'Data extraction-synthesis'!M32)),\"X\",\"\")","v":""}]
["Pal S, Jasper L.E., Lawrence K.L, Walter M","Assessing the Dengue Diagnosis Capability Gap in the Military Health System",{"$f":"IF(ISNUMBER(SEARCH(\"Industry (unspecific)\",'Data extraction-synthesis'!M33)),\"X\",\"\")","v":""},null,"",{"$nulls":3},{"$f":"IF(ISNUMBER(SEARCH(\"Test developers\",'Data extraction-synthesis'!M33)),\"X\",\"\")","v":""},null,{"$f":"IF(ISNUMBER(SEARCH(\"Academia/researchers\",'Data extraction-synthesis'!M33)),\"X\",\"\")","v":""},{"$nulls":3},{"$f":"IF(ISNUMBER(SEARCH(\"Clinicians\",'Data extraction-synthesis'!M33)),\"X\",\"\")","v":""},{"$nulls":3},{"$f":"IF(ISNUMBER(SEARCH(\"Representatives of countries and national disease programs\",'Data extraction-synthesis'!M33)),\"X\",\"\")","v":""},{"$nulls":3},{"$f":"IF(ISNUMBER(SEARCH(\"International/public health institution \",'Data extraction-synthesis'!M33)),\"X\",\"\")","v":""},{"$nulls":3},{"$f":"IF(ISNUMBER(SEARCH(\"Experts (unspecific)\",'Data extraction-synthesis'!M33)),\"X\",\"\")","v":"X"},"Scoping","Drafting",{"$f":"IF(ISNUMBER(SEARCH(\"Laboratory experts\",'Data extraction-synthesis'!M33)),\"X\",\"\")","v":""},null,null,{"$f":"IF(ISNUMBER(SEARCH(\"Non-profit sector\",'Data extraction-synthesis'!M33)),\"X\",\"\")","v":""},null,null,{"$f":"IF(ISNUMBER(SEARCH(\"Technical/funding agencies\",'Data extraction-synthesis'!M33)),\"X\",\"\")","v":""},{"$nulls":3},{"$f":"IF(ISNUMBER(SEARCH(\"Policy makers\",'Data extraction-synthesis'!M33)),\"X\",\"\")","v":""},{"$nulls":3},{"$f":"IF(ISNUMBER(SEARCH(\"Implementers\",'Data extraction-synthesis'!M33)),\"X\",\"\")","v":""},{"$nulls":3},{"$f":"IF(ISNUMBER(SEARCH(\"Patient/community advocates\",'Data extraction-synthesis'!M33)),\"X\",\"\")","v":""},{"$nulls":3},{"$f":"IF(ISNUMBER(SEARCH(\"Microbiologists\",'Data extraction-synthesis'!M33)),\"X\",\"\")","v":""},{"$nulls":3},{"$f":"IF(ISNUMBER(SEARCH(\"Modelers\",'Data extraction-synthesis'!M33)),\"X\",\"\")","v":""},null,null,{"$f":"IF(ISNUMBER(SEARCH(\"Health economists\",'Data extraction-synthesis'!M33)),\"X\",\"\")","v":""},null,null,{"$f":"IF(ISNUMBER(SEARCH(\"Donors\",'Data extraction-synthesis'!M33)),\"X\",\"\")","v":""},null,null,{"$f":"IF(ISNUMBER(SEARCH(\"Market experts\",'Data extraction-synthesis'!M33)),\"X\",\"\")","v":""},{"$nulls":3},{"$f":"IF(ISNUMBER(SEARCH(\"Program manager\",'Data extraction-synthesis'!M33)),\"X\",\"\")","v":""},null,null,{"$f":"IF(ISNUMBER(SEARCH(\"Scientific associations\",'Data extraction-synthesis'!M33)),\"X\",\"\")","v":""},{"$nulls":3},{"$f":"IF(ISNUMBER(SEARCH(\"Strategists\",'Data extraction-synthesis'!M33)),\"X\",\"\")","v":""},null,null,{"$f":"IF(ISNUMBER(SEARCH(\"Other\",'Data extraction-synthesis'!M33)),\"X\",\"\")","v":"X"},"Scoping","Drafting"]
["PATH","Target Product Profile: Schistosomiasis Surveillance Diagnostic Lateral Flow Test CAA antigen",{"$f":"IF(ISNUMBER(SEARCH(\"Industry (unspecific)\",'Data extraction-synthesis'!M34)),\"X\",\"\")","v":""},null,"",{"$nulls":3},{"$f":"IF(ISNUMBER(SEARCH(\"Test developers\",'Data extraction-synthesis'!M34)),\"X\",\"\")","v":""},null,{"$f":"IF(ISNUMBER(SEARCH(\"Academia/researchers\",'Data extraction-synthesis'!M34)),\"X\",\"\")","v":""},{"$nulls":3},{"$f":"IF(ISNUMBER(SEARCH(\"Clinicians\",'Data extraction-synthesis'!M34)),\"X\",\"\")","v":""},{"$nulls":3},{"$f":"IF(ISNUMBER(SEARCH(\"Representatives of countries and national disease programs\",'Data extraction-synthesis'!M34)),\"X\",\"\")","v":""},{"$nulls":3},{"$f":"IF(ISNUMBER(SEARCH(\"International/public health institution \",'Data extraction-synthesis'!M34)),\"X\",\"\")","v":""},{"$nulls":3},{"$f":"IF(ISNUMBER(SEARCH(\"Experts (unspecific)\",'Data extraction-synthesis'!M34)),\"X\",\"\")","v":""},null,null,{"$f":"IF(ISNUMBER(SEARCH(\"Laboratory experts\",'Data extraction-synthesis'!M34)),\"X\",\"\")","v":""},null,null,{"$f":"IF(ISNUMBER(SEARCH(\"Non-profit sector\",'Data extraction-synthesis'!M34)),\"X\",\"\")","v":""},null,null,{"$f":"IF(ISNUMBER(SEARCH(\"Technical/funding agencies\",'Data extraction-synthesis'!M34)),\"X\",\"\")","v":""},{"$nulls":3},{"$f":"IF(ISNUMBER(SEARCH(\"Policy makers\",'Data extraction-synthesis'!M34)),\"X\",\"\")","v":""},{"$nulls":3},{"$f":"IF(ISNUMBER(SEARCH(\"Implementers\",'Data extraction-synthesis'!M34)),\"X\",\"\")","v":""},{"$nulls":3},{"$f":"IF(ISNUMBER(SEARCH(\"Patient/community advocates\",'Data extraction-synthesis'!M34)),\"X\",\"\")","v":""},{"$nulls":3},{"$f":"IF(ISNUMBER(SEARCH(\"Microbiologists\",'Data extraction-synthesis'!M34)),\"X\",\"\")","v":""},{"$nulls":3},{"$f":"IF(ISNUMBER(SEARCH(\"Modelers\",'Data extraction-synthesis'!M34)),\"X\",\"\")","v":""},null,null,{"$f":"IF(ISNUMBER(SEARCH(\"Health economists\",'Data extraction-synthesis'!M34)),\"X\",\"\")","v":""},null,null,{"$f":"IF(ISNUMBER(SEARCH(\"Donors\",'Data extraction-synthesis'!M34)),\"X\",\"\")","v":""},null,null,{"$f":"IF(ISNUMBER(SEARCH(\"Market experts\",'Data extraction-synthesis'!M34)),\"X\",\"\")","v":""},{"$nulls":3},{"$f":"IF(ISNUMBER(SEARCH(\"Program manager\",'Data extraction-synthesis'!M34)),\"X\",\"\")","v":""},null,null,{"$f":"IF(ISNUMBER(SEARCH(\"Scientific associations\",'Data extraction-synthesis'!M34)),\"X\",\"\")","v":""},{"$nulls":3},{"$f":"IF(ISNUMBER(SEARCH(\"Strategists\",'Data extraction-synthesis'!M34)),\"X\",\"\")","v":""},null,null,{"$f":"IF(ISNUMBER(SEARCH(\"Other\",'Data extraction-synthesis'!M34)),\"X\",\"\")","v":""}]
["PATH","Target Product Profile: Trachoma Surveillance Diagnostic-Post-Elimination Surveillance Antibody Lateral Flow Test",{"$f":"IF(ISNUMBER(SEARCH(\"Industry (unspecific)\",'Data extraction-synthesis'!M35)),\"X\",\"\")","v":""},null,"",{"$nulls":3},{"$f":"IF(ISNUMBER(SEARCH(\"Test developers\",'Data extraction-synthesis'!M35)),\"X\",\"\")","v":""},null,{"$f":"IF(ISNUMBER(SEARCH(\"Academia/researchers\",'Data extraction-synthesis'!M35)),\"X\",\"\")","v":""},{"$nulls":3},{"$f":"IF(ISNUMBER(SEARCH(\"Clinicians\",'Data extraction-synthesis'!M35)),\"X\",\"\")","v":""},{"$nulls":3},{"$f":"IF(ISNUMBER(SEARCH(\"Representatives of countries and national disease programs\",'Data extraction-synthesis'!M35)),\"X\",\"\")","v":""},{"$nulls":3},{"$f":"IF(ISNUMBER(SEARCH(\"International/public health institution \",'Data extraction-synthesis'!M35)),\"X\",\"\")","v":""},{"$nulls":3},{"$f":"IF(ISNUMBER(SEARCH(\"Experts (unspecific)\",'Data extraction-synthesis'!M35)),\"X\",\"\")","v":""},null,null,{"$f":"IF(ISNUMBER(SEARCH(\"Laboratory experts\",'Data extraction-synthesis'!M35)),\"X\",\"\")","v":""},null,null,{"$f":"IF(ISNUMBER(SEARCH(\"Non-profit sector\",'Data extraction-synthesis'!M35)),\"X\",\"\")","v":""},null,null,{"$f":"IF(ISNUMBER(SEARCH(\"Technical/funding agencies\",'Data extraction-synthesis'!M35)),\"X\",\"\")","v":""},{"$nulls":3},{"$f":"IF(ISNUMBER(SEARCH(\"Policy makers\",'Data extraction-synthesis'!M35)),\"X\",\"\")","v":""},{"$nulls":3},{"$f":"IF(ISNUMBER(SEARCH(\"Implementers\",'Data extraction-synthesis'!M35)),\"X\",\"\")","v":""},{"$nulls":3},{"$f":"IF(ISNUMBER(SEARCH(\"Patient/community advocates\",'Data extraction-synthesis'!M35)),\"X\",\"\")","v":""},{"$nulls":3},{"$f":"IF(ISNUMBER(SEARCH(\"Microbiologists\",'Data extraction-synthesis'!M35)),\"X\",\"\")","v":""},{"$nulls":3},{"$f":"IF(ISNUMBER(SEARCH(\"Modelers\",'Data extraction-synthesis'!M35)),\"X\",\"\")","v":""},null,null,{"$f":"IF(ISNUMBER(SEARCH(\"Health economists\",'Data extraction-synthesis'!M35)),\"X\",\"\")","v":""},null,null,{"$f":"IF(ISNUMBER(SEARCH(\"Donors\",'Data extraction-synthesis'!M35)),\"X\",\"\")","v":""},null,null,{"$f":"IF(ISNUMBER(SEARCH(\"Market experts\",'Data extraction-synthesis'!M35)),\"X\",\"\")","v":""},{"$nulls":3},{"$f":"IF(ISNUMBER(SEARCH(\"Program manager\",'Data extraction-synthesis'!M35)),\"X\",\"\")","v":""},null,null,{"$f":"IF(ISNUMBER(SEARCH(\"Scientific associations\",'Data extraction-synthesis'!M35)),\"X\",\"\")","v":""},{"$nulls":3},{"$f":"IF(ISNUMBER(SEARCH(\"Strategists\",'Data extraction-synthesis'!M35)),\"X\",\"\")","v":""},null,null,{"$f":"IF(ISNUMBER(SEARCH(\"Other\",'Data extraction-synthesis'!M35)),\"X\",\"\")","v":""}]
["International Diagnostics Centre (IDC)","Target Product Profile (TPP) - Point-of-Care HIV Viral Load Test",{"$f":"IF(ISNUMBER(SEARCH(\"Industry (unspecific)\",'Data extraction-synthesis'!M36)),\"X\",\"\")","v":""},null,"",{"$nulls":3},{"$f":"IF(ISNUMBER(SEARCH(\"Test developers\",'Data extraction-synthesis'!M36)),\"X\",\"\")","v":""},null,{"$f":"IF(ISNUMBER(SEARCH(\"Academia/researchers\",'Data extraction-synthesis'!M36)),\"X\",\"\")","v":""},{"$nulls":3},{"$f":"IF(ISNUMBER(SEARCH(\"Clinicians\",'Data extraction-synthesis'!M36)),\"X\",\"\")","v":""},{"$nulls":3},{"$f":"IF(ISNUMBER(SEARCH(\"Representatives of countries and national disease programs\",'Data extraction-synthesis'!M36)),\"X\",\"\")","v":""},{"$nulls":3},{"$f":"IF(ISNUMBER(SEARCH(\"International/public health institution \",'Data extraction-synthesis'!M36)),\"X\",\"\")","v":""},{"$nulls":3},{"$f":"IF(ISNUMBER(SEARCH(\"Experts (unspecific)\",'Data extraction-synthesis'!M36)),\"X\",\"\")","v":""},null,null,{"$f":"IF(ISNUMBER(SEARCH(\"Laboratory experts\",'Data extraction-synthesis'!M36)),\"X\",\"\")","v":""},null,null,{"$f":"IF(ISNUMBER(SEARCH(\"Non-profit sector\",'Data extraction-synthesis'!M36)),\"X\",\"\")","v":""},null,null,{"$f":"IF(ISNUMBER(SEARCH(\"Technical/funding agencies\",'Data extraction-synthesis'!M36)),\"X\",\"\")","v":""},{"$nulls":3},{"$f":"IF(ISNUMBER(SEARCH(\"Policy makers\",'Data extraction-synthesis'!M36)),\"X\",\"\")","v":""},{"$nulls":3},{"$f":"IF(ISNUMBER(SEARCH(\"Implementers\",'Data extraction-synthesis'!M36)),\"X\",\"\")","v":""},{"$nulls":3},{"$f":"IF(ISNUMBER(SEARCH(\"Patient/community advocates\",'Data extraction-synthesis'!M36)),\"X\",\"\")","v":""},{"$nulls":3},{"$f":"IF(ISNUMBER(SEARCH(\"Microbiologists\",'Data extraction-synthesis'!M36)),\"X\",\"\")","v":""},{"$nulls":3},{"$f":"IF(ISNUMBER(SEARCH(\"Modelers\",'Data extraction-synthesis'!M36)),\"X\",\"\")","v":""},null,null,{"$f":"IF(ISNUMBER(SEARCH(\"Health economists\",'Data extraction-synthesis'!M36)),\"X\",\"\")","v":""},null,null,{"$f":"IF(ISNUMBER(SEARCH(\"Donors\",'Data extraction-synthesis'!M36)),\"X\",\"\")","v":""},null,null,{"$f":"IF(ISNUMBER(SEARCH(\"Market experts\",'Data extraction-synthesis'!M36)),\"X\",\"\")","v":""},{"$nulls":3},{"$f":"IF(ISNUMBER(SEARCH(\"Program manager\",'Data extraction-synthesis'!M36)),\"X\",\"\")","v":""},null,null,{"$f":"IF(ISNUMBER(SEARCH(\"Scientific associations\",'Data extraction-synthesis'!M36)),\"X\",\"\")","v":""},{"$nulls":3},{"$f":"IF(ISNUMBER(SEARCH(\"Strategists\",'Data extraction-synthesis'!M36)),\"X\",\"\")","v":""},null,null,{"$f":"IF(ISNUMBER(SEARCH(\"Other\",'Data extraction-synthesis'!M36)),\"X\",\"\")","v":""}]
["International Diagnostics Centre (IDC)","Target Product Profile (TPP)- Point of care CD4 test",{"$f":"IF(ISNUMBER(SEARCH(\"Industry (unspecific)\",'Data extraction-synthesis'!M37)),\"X\",\"\")","v":""},null,"",{"$nulls":3},{"$f":"IF(ISNUMBER(SEARCH(\"Test developers\",'Data extraction-synthesis'!M37)),\"X\",\"\")","v":""},null,{"$f":"IF(ISNUMBER(SEARCH(\"Academia/researchers\",'Data extraction-synthesis'!M37)),\"X\",\"\")","v":""},{"$nulls":3},{"$f":"IF(ISNUMBER(SEARCH(\"Clinicians\",'Data extraction-synthesis'!M37)),\"X\",\"\")","v":""},{"$nulls":3},{"$f":"IF(ISNUMBER(SEARCH(\"Representatives of countries and national disease programs\",'Data extraction-synthesis'!M37)),\"X\",\"\")","v":""},{"$nulls":3},{"$f":"IF(ISNUMBER(SEARCH(\"International/public health institution \",'Data extraction-synthesis'!M37)),\"X\",\"\")","v":""},{"$nulls":3},{"$f":"IF(ISNUMBER(SEARCH(\"Experts (unspecific)\",'Data extraction-synthesis'!M37)),\"X\",\"\")","v":""},null,null,{"$f":"IF(ISNUMBER(SEARCH(\"Laboratory experts\",'Data extraction-synthesis'!M37)),\"X\",\"\")","v":""},null,null,{"$f":"IF(ISNUMBER(SEARCH(\"Non-profit sector\",'Data extraction-synthesis'!M37)),\"X\",\"\")","v":""},null,null,{"$f":"IF(ISNUMBER(SEARCH(\"Technical/funding agencies\",'Data extraction-synthesis'!M37)),\"X\",\"\")","v":""},{"$nulls":3},{"$f":"IF(ISNUMBER(SEARCH(\"Policy makers\",'Data extraction-synthesis'!M37)),\"X\",\"\")","v":""},{"$nulls":3},{"$f":"IF(ISNUMBER(SEARCH(\"Implementers\",'Data extraction-synthesis'!M37)),\"X\",\"\")","v":""},{"$nulls":3},{"$f":"IF(ISNUMBER(SEARCH(\"Patient/community advocates\",'Data extraction-synthesis'!M37)),\"X\",\"\")","v":""},{"$nulls":3},{"$f":"IF(ISNUMBER(SEARCH(\"Microbiologists\",'Data extraction-synthesis'!M37)),\"X\",\"\")","v":""},{"$nulls":3},{"$f":"IF(ISNUMBER(SEARCH(\"Modelers\",'Data extraction-synthesis'!M37)),\"X\",\"\")","v":""},null,null,{"$f":"IF(ISNUMBER(SEARCH(\"Health economists\",'Data extraction-synthesis'!M37)),\"X\",\"\")","v":""},null,null,{"$f":"IF(ISNUMBER(SEARCH(\"Donors\",'Data extraction-synthesis'!M37)),\"X\",\"\")","v":""},null,null,{"$f":"IF(ISNUMBER(SEARCH(\"Market experts\",'Data extraction-synthesis'!M37)),\"X\",\"\")","v":""},{"$nulls":3},{"$f":"IF(ISNUMBER(SEARCH(\"Program manager\",'Data extraction-synthesis'!M37)),\"X\",\"\")","v":""},null,null,{"$f":"IF(ISNUMBER(SEARCH(\"Scientific associations\",'Data extraction-synthesis'!M37)),\"X\",\"\")","v":""},{"$nulls":3},{"$f":"IF(ISNUMBER(SEARCH(\"Strategists\",'Data extraction-synthesis'!M37)),\"X\",\"\")","v":""},null,null,{"$f":"IF(ISNUMBER(SEARCH(\"Other\",'Data extraction-synthesis'!M37)),\"X\",\"\")","v":""}]
["International Diagnostics Centre (IDC)","Target Product Profile (TPP): Point of care EID test",{"$f":"IF(ISNUMBER(SEARCH(\"Industry (unspecific)\",'Data extraction-synthesis'!M38)),\"X\",\"\")","v":""},null,"",{"$nulls":3},{"$f":"IF(ISNUMBER(SEARCH(\"Test developers\",'Data extraction-synthesis'!M38)),\"X\",\"\")","v":""},null,{"$f":"IF(ISNUMBER(SEARCH(\"Academia/researchers\",'Data extraction-synthesis'!M38)),\"X\",\"\")","v":""},{"$nulls":3},{"$f":"IF(ISNUMBER(SEARCH(\"Clinicians\",'Data extraction-synthesis'!M38)),\"X\",\"\")","v":""},{"$nulls":3},{"$f":"IF(ISNUMBER(SEARCH(\"Representatives of countries and national disease programs\",'Data extraction-synthesis'!M38)),\"X\",\"\")","v":""},{"$nulls":3},{"$f":"IF(ISNUMBER(SEARCH(\"International/public health institution \",'Data extraction-synthesis'!M38)),\"X\",\"\")","v":""},{"$nulls":3},{"$f":"IF(ISNUMBER(SEARCH(\"Experts (unspecific)\",'Data extraction-synthesis'!M38)),\"X\",\"\")","v":""},null,null,{"$f":"IF(ISNUMBER(SEARCH(\"Laboratory experts\",'Data extraction-synthesis'!M38)),\"X\",\"\")","v":""},null,null,{"$f":"IF(ISNUMBER(SEARCH(\"Non-profit sector\",'Data extraction-synthesis'!M38)),\"X\",\"\")","v":""},null,null,{"$f":"IF(ISNUMBER(SEARCH(\"Technical/funding agencies\",'Data extraction-synthesis'!M38)),\"X\",\"\")","v":""},{"$nulls":3},{"$f":"IF(ISNUMBER(SEARCH(\"Policy makers\",'Data extraction-synthesis'!M38)),\"X\",\"\")","v":""},{"$nulls":3},{"$f":"IF(ISNUMBER(SEARCH(\"Implementers\",'Data extraction-synthesis'!M38)),\"X\",\"\")","v":""},{"$nulls":3},{"$f":"IF(ISNUMBER(SEARCH(\"Patient/community advocates\",'Data extraction-synthesis'!M38)),\"X\",\"\")","v":""},{"$nulls":3},{"$f":"IF(ISNUMBER(SEARCH(\"Microbiologists\",'Data extraction-synthesis'!M38)),\"X\",\"\")","v":""},{"$nulls":3},{"$f":"IF(ISNUMBER(SEARCH(\"Modelers\",'Data extraction-synthesis'!M38)),\"X\",\"\")","v":""},null,null,{"$f":"IF(ISNUMBER(SEARCH(\"Health economists\",'Data extraction-synthesis'!M38)),\"X\",\"\")","v":""},null,null,{"$f":"IF(ISNUMBER(SEARCH(\"Donors\",'Data extraction-synthesis'!M38)),\"X\",\"\")","v":""},null,null,{"$f":"IF(ISNUMBER(SEARCH(\"Market experts\",'Data extraction-synthesis'!M38)),\"X\",\"\")","v":""},{"$nulls":3},{"$f":"IF(ISNUMBER(SEARCH(\"Program manager\",'Data extraction-synthesis'!M38)),\"X\",\"\")","v":""},null,null,{"$f":"IF(ISNUMBER(SEARCH(\"Scientific associations\",'Data extraction-synthesis'!M38)),\"X\",\"\")","v":""},{"$nulls":3},{"$f":"IF(ISNUMBER(SEARCH(\"Strategists\",'Data extraction-synthesis'!M38)),\"X\",\"\")","v":""},null,null,{"$f":"IF(ISNUMBER(SEARCH(\"Other\",'Data extraction-synthesis'!M38)),\"X\",\"\")","v":""}]
["Internationa Diagnostics Centre (IDC)","Target Product Profile (TPP): Combined HIV/Syphilis Test",{"$f":"IF(ISNUMBER(SEARCH(\"Industry (unspecific)\",'Data extraction-synthesis'!M39)),\"X\",\"\")","v":""},null,"",{"$nulls":3},{"$f":"IF(ISNUMBER(SEARCH(\"Test developers\",'Data extraction-synthesis'!M39)),\"X\",\"\")","v":""},null,{"$f":"IF(ISNUMBER(SEARCH(\"Academia/researchers\",'Data extraction-synthesis'!M39)),\"X\",\"\")","v":""},{"$nulls":3},{"$f":"IF(ISNUMBER(SEARCH(\"Clinicians\",'Data extraction-synthesis'!M39)),\"X\",\"\")","v":""},{"$nulls":3},{"$f":"IF(ISNUMBER(SEARCH(\"Representatives of countries and national disease programs\",'Data extraction-synthesis'!M39)),\"X\",\"\")","v":""},{"$nulls":3},{"$f":"IF(ISNUMBER(SEARCH(\"International/public health institution \",'Data extraction-synthesis'!M39)),\"X\",\"\")","v":""},{"$nulls":3},{"$f":"IF(ISNUMBER(SEARCH(\"Experts (unspecific)\",'Data extraction-synthesis'!M39)),\"X\",\"\")","v":""},null,null,{"$f":"IF(ISNUMBER(SEARCH(\"Laboratory experts\",'Data extraction-synthesis'!M39)),\"X\",\"\")","v":""},null,null,{"$f":"IF(ISNUMBER(SEARCH(\"Non-profit sector\",'Data extraction-synthesis'!M39)),\"X\",\"\")","v":""},null,null,{"$f":"IF(ISNUMBER(SEARCH(\"Technical/funding agencies\",'Data extraction-synthesis'!M39)),\"X\",\"\")","v":""},{"$nulls":3},{"$f":"IF(ISNUMBER(SEARCH(\"Policy makers\",'Data extraction-synthesis'!M39)),\"X\",\"\")","v":""},{"$nulls":3},{"$f":"IF(ISNUMBER(SEARCH(\"Implementers\",'Data extraction-synthesis'!M39)),\"X\",\"\")","v":""},{"$nulls":3},{"$f":"IF(ISNUMBER(SEARCH(\"Patient/community advocates\",'Data extraction-synthesis'!M39)),\"X\",\"\")","v":""},{"$nulls":3},{"$f":"IF(ISNUMBER(SEARCH(\"Microbiologists\",'Data extraction-synthesis'!M39)),\"X\",\"\")","v":""},{"$nulls":3},{"$f":"IF(ISNUMBER(SEARCH(\"Modelers\",'Data extraction-synthesis'!M39)),\"X\",\"\")","v":""},null,null,{"$f":"IF(ISNUMBER(SEARCH(\"Health economists\",'Data extraction-synthesis'!M39)),\"X\",\"\")","v":""},null,null,{"$f":"IF(ISNUMBER(SEARCH(\"Donors\",'Data extraction-synthesis'!M39)),\"X\",\"\")","v":""},null,null,{"$f":"IF(ISNUMBER(SEARCH(\"Market experts\",'Data extraction-synthesis'!M39)),\"X\",\"\")","v":""},{"$nulls":3},{"$f":"IF(ISNUMBER(SEARCH(\"Program manager\",'Data extraction-synthesis'!M39)),\"X\",\"\")","v":""},null,null,{"$f":"IF(ISNUMBER(SEARCH(\"Scientific associations\",'Data extraction-synthesis'!M39)),\"X\",\"\")","v":""},{"$nulls":3},{"$f":"IF(ISNUMBER(SEARCH(\"Strategists\",'Data extraction-synthesis'!M39)),\"X\",\"\")","v":""},null,null,{"$f":"IF(ISNUMBER(SEARCH(\"Other\",'Data extraction-synthesis'!M39)),\"X\",\"\")","v":""}]
["Ebels, K. B. C., C.: Crudder, C. H.: McGray, S.: Magnuson, K.: Tietje, K.: Labarre, P","Incorporating user needs into product development for improved infection detection for malaria elimination programs",{"$f":"IF(ISNUMBER(SEARCH(\"Industry (unspecific)\",'Data extraction-synthesis'!M40)),\"X\",\"\")","v":""},2,"X","Scoping","Drafting",null,{"$f":"IF(ISNUMBER(SEARCH(\"Test developers\",'Data extraction-synthesis'!M40)),\"X\",\"\")","v":"X"},null,{"$f":"IF(ISNUMBER(SEARCH(\"Academia/researchers\",'Data extraction-synthesis'!M40)),\"X\",\"\")","v":"X"},"Scoping","Drafting",null,{"$f":"IF(ISNUMBER(SEARCH(\"Clinicians\",'Data extraction-synthesis'!M40)),\"X\",\"\")","v":"X"},"Scoping","Drafting",null,{"$f":"IF(ISNUMBER(SEARCH(\"Representatives of countries and national disease programs\",'Data extraction-synthesis'!M40)),\"X\",\"\")","v":"X"},"Scoping","Drafting",null,{"$f":"IF(ISNUMBER(SEARCH(\"International/public health institution \",'Data extraction-synthesis'!M40)),\"X\",\"\")","v":"X"},"Scoping","Drafting",null,{"$f":"IF(ISNUMBER(SEARCH(\"Experts (unspecific)\",'Data extraction-synthesis'!M40)),\"X\",\"\")","v":""},null,null,{"$f":"IF(ISNUMBER(SEARCH(\"Laboratory experts\",'Data extraction-synthesis'!M40)),\"X\",\"\")","v":"X"},"Scoping","Drafting",{"$f":"IF(ISNUMBER(SEARCH(\"Non-profit sector\",'Data extraction-synthesis'!M40)),\"X\",\"\")","v":""},null,null,{"$f":"IF(ISNUMBER(SEARCH(\"Technical/funding agencies\",'Data extraction-synthesis'!M40)),\"X\",\"\")","v":""},{"$nulls":3},{"$f":"IF(ISNUMBER(SEARCH(\"Policy makers\",'Data extraction-synthesis'!M40)),\"X\",\"\")","v":"X"},"Scoping","Drafting",null,{"$f":"IF(ISNUMBER(SEARCH(\"Implementers\",'Data extraction-synthesis'!M40)),\"X\",\"\")","v":""},{"$nulls":3},{"$f":"IF(ISNUMBER(SEARCH(\"Patient/community advocates\",'Data extraction-synthesis'!M40)),\"X\",\"\")","v":""},{"$nulls":3},{"$f":"IF(ISNUMBER(SEARCH(\"Microbiologists\",'Data extraction-synthesis'!M40)),\"X\",\"\")","v":"X"},"Scoping","Drafting",null,{"$f":"IF(ISNUMBER(SEARCH(\"Modelers\",'Data extraction-synthesis'!M40)),\"X\",\"\")","v":""},null,null,{"$f":"IF(ISNUMBER(SEARCH(\"Health economists\",'Data extraction-synthesis'!M40)),\"X\",\"\")","v":""},null,null,{"$f":"IF(ISNUMBER(SEARCH(\"Donors\",'Data extraction-synthesis'!M40)),\"X\",\"\")","v":"X"},"Scoping","Drafting",{"$f":"IF(ISNUMBER(SEARCH(\"Market experts\",'Data extraction-synthesis'!M40)),\"X\",\"\")","v":""},{"$nulls":3},{"$f":"IF(ISNUMBER(SEARCH(\"Program manager\",'Data extraction-synthesis'!M40)),\"X\",\"\")","v":"X"},"Scoping","Drafting",{"$f":"IF(ISNUMBER(SEARCH(\"Scientific associations\",'Data extraction-synthesis'!M40)),\"X\",\"\")","v":""},{"$nulls":3},{"$f":"IF(ISNUMBER(SEARCH(\"Strategists\",'Data extraction-synthesis'!M40)),\"X\",\"\")","v":"X"},"Scoping","Drafting",{"$f":"IF(ISNUMBER(SEARCH(\"Other\",'Data extraction-synthesis'!M40)),\"X\",\"\")","v":""}]
["FIND","Target Product Profile: Screening test for human African trypanosomiasis (HAT)",{"$f":"IF(ISNUMBER(SEARCH(\"Industry (unspecific)\",'Data extraction-synthesis'!M41)),\"X\",\"\")","v":"X"},null,"X","Consensus-building",null,null,{"$f":"IF(ISNUMBER(SEARCH(\"Test developers\",'Data extraction-synthesis'!M41)),\"X\",\"\")","v":""},null,{"$f":"IF(ISNUMBER(SEARCH(\"Academia/researchers\",'Data extraction-synthesis'!M41)),\"X\",\"\")","v":"X"},"Consensus-building",null,null,{"$f":"IF(ISNUMBER(SEARCH(\"Clinicians\",'Data extraction-synthesis'!M41)),\"X\",\"\")","v":""},{"$nulls":3},{"$f":"IF(ISNUMBER(SEARCH(\"Representatives of countries and national disease programs\",'Data extraction-synthesis'!M41)),\"X\",\"\")","v":""},{"$nulls":3},{"$f":"IF(ISNUMBER(SEARCH(\"International/public health institution \",'Data extraction-synthesis'!M41)),\"X\",\"\")","v":"X"},"Consensus-building",null,null,{"$f":"IF(ISNUMBER(SEARCH(\"Experts (unspecific)\",'Data extraction-synthesis'!M41)),\"X\",\"\")","v":""},null,null,{"$f":"IF(ISNUMBER(SEARCH(\"Laboratory experts\",'Data extraction-synthesis'!M41)),\"X\",\"\")","v":""},null,null,{"$f":"IF(ISNUMBER(SEARCH(\"Non-profit sector\",'Data extraction-synthesis'!M41)),\"X\",\"\")","v":"X"},"Consensus-building",null,{"$f":"IF(ISNUMBER(SEARCH(\"Technical/funding agencies\",'Data extraction-synthesis'!M41)),\"X\",\"\")","v":""},{"$nulls":3},{"$f":"IF(ISNUMBER(SEARCH(\"Policy makers\",'Data extraction-synthesis'!M41)),\"X\",\"\")","v":""},{"$nulls":3},{"$f":"IF(ISNUMBER(SEARCH(\"Implementers\",'Data extraction-synthesis'!M41)),\"X\",\"\")","v":""},{"$nulls":3},{"$f":"IF(ISNUMBER(SEARCH(\"Patient/community advocates\",'Data extraction-synthesis'!M41)),\"X\",\"\")","v":""},{"$nulls":3},{"$f":"IF(ISNUMBER(SEARCH(\"Microbiologists\",'Data extraction-synthesis'!M41)),\"X\",\"\")","v":""},{"$nulls":3},{"$f":"IF(ISNUMBER(SEARCH(\"Modelers\",'Data extraction-synthesis'!M41)),\"X\",\"\")","v":""},null,null,{"$f":"IF(ISNUMBER(SEARCH(\"Health economists\",'Data extraction-synthesis'!M41)),\"X\",\"\")","v":""},null,null,{"$f":"IF(ISNUMBER(SEARCH(\"Donors\",'Data extraction-synthesis'!M41)),\"X\",\"\")","v":""},null,null,{"$f":"IF(ISNUMBER(SEARCH(\"Market experts\",'Data extraction-synthesis'!M41)),\"X\",\"\")","v":""},{"$nulls":3},{"$f":"IF(ISNUMBER(SEARCH(\"Program manager\",'Data extraction-synthesis'!M41)),\"X\",\"\")","v":""},null,null,{"$f":"IF(ISNUMBER(SEARCH(\"Scientific associations\",'Data extraction-synthesis'!M41)),\"X\",\"\")","v":""},{"$nulls":3},{"$f":"IF(ISNUMBER(SEARCH(\"Strategists\",'Data extraction-synthesis'!M41)),\"X\",\"\")","v":""},null,null,{"$f":"IF(ISNUMBER(SEARCH(\"Other\",'Data extraction-synthesis'!M41)),\"X\",\"\")","v":""}]
["PATH","Target Product Profile: Trachoma surveillance diagnostic-antigen lateral flow test",{"$f":"IF(ISNUMBER(SEARCH(\"Industry (unspecific)\",'Data extraction-synthesis'!M42)),\"X\",\"\")","v":""},null,"",{"$nulls":3},{"$f":"IF(ISNUMBER(SEARCH(\"Test developers\",'Data extraction-synthesis'!M42)),\"X\",\"\")","v":""},null,{"$f":"IF(ISNUMBER(SEARCH(\"Academia/researchers\",'Data extraction-synthesis'!M42)),\"X\",\"\")","v":""},{"$nulls":3},{"$f":"IF(ISNUMBER(SEARCH(\"Clinicians\",'Data extraction-synthesis'!M42)),\"X\",\"\")","v":""},{"$nulls":3},{"$f":"IF(ISNUMBER(SEARCH(\"Representatives of countries and national disease programs\",'Data extraction-synthesis'!M42)),\"X\",\"\")","v":""},{"$nulls":3},{"$f":"IF(ISNUMBER(SEARCH(\"International/public health institution \",'Data extraction-synthesis'!M42)),\"X\",\"\")","v":""},{"$nulls":3},{"$f":"IF(ISNUMBER(SEARCH(\"Experts (unspecific)\",'Data extraction-synthesis'!M42)),\"X\",\"\")","v":""},null,null,{"$f":"IF(ISNUMBER(SEARCH(\"Laboratory experts\",'Data extraction-synthesis'!M42)),\"X\",\"\")","v":""},null,null,{"$f":"IF(ISNUMBER(SEARCH(\"Non-profit sector\",'Data extraction-synthesis'!M42)),\"X\",\"\")","v":""},null,null,{"$f":"IF(ISNUMBER(SEARCH(\"Technical/funding agencies\",'Data extraction-synthesis'!M42)),\"X\",\"\")","v":""},{"$nulls":3},{"$f":"IF(ISNUMBER(SEARCH(\"Policy makers\",'Data extraction-synthesis'!M42)),\"X\",\"\")","v":""},{"$nulls":3},{"$f":"IF(ISNUMBER(SEARCH(\"Implementers\",'Data extraction-synthesis'!M42)),\"X\",\"\")","v":""},{"$nulls":3},{"$f":"IF(ISNUMBER(SEARCH(\"Patient/community advocates\",'Data extraction-synthesis'!M42)),\"X\",\"\")","v":""},{"$nulls":3},{"$f":"IF(ISNUMBER(SEARCH(\"Microbiologists\",'Data extraction-synthesis'!M42)),\"X\",\"\")","v":""},{"$nulls":3},{"$f":"IF(ISNUMBER(SEARCH(\"Modelers\",'Data extraction-synthesis'!M42)),\"X\",\"\")","v":""},null,null,{"$f":"IF(ISNUMBER(SEARCH(\"Health economists\",'Data extraction-synthesis'!M42)),\"X\",\"\")","v":""},null,null,{"$f":"IF(ISNUMBER(SEARCH(\"Donors\",'Data extraction-synthesis'!M42)),\"X\",\"\")","v":""},null,null,{"$f":"IF(ISNUMBER(SEARCH(\"Market experts\",'Data extraction-synthesis'!M42)),\"X\",\"\")","v":""},{"$nulls":3},{"$f":"IF(ISNUMBER(SEARCH(\"Program manager\",'Data extraction-synthesis'!M42)),\"X\",\"\")","v":""},null,null,{"$f":"IF(ISNUMBER(SEARCH(\"Scientific associations\",'Data extraction-synthesis'!M42)),\"X\",\"\")","v":""},{"$nulls":3},{"$f":"IF(ISNUMBER(SEARCH(\"Strategists\",'Data extraction-synthesis'!M42)),\"X\",\"\")","v":""},null,null,{"$f":"IF(ISNUMBER(SEARCH(\"Other\",'Data extraction-synthesis'!M42)),\"X\",\"\")","v":""}]
["Peck, R. B. W., J. D.: Boettcher, M. G.: Downing","Defining product requirements for field deployable yellow fever tests",{"$f":"IF(ISNUMBER(SEARCH(\"Industry (unspecific)\",'Data extraction-synthesis'!M43)),\"X\",\"\")","v":""},1,"X","Scoping","Drafting",null,{"$f":"IF(ISNUMBER(SEARCH(\"Test developers\",'Data extraction-synthesis'!M43)),\"X\",\"\")","v":"X"},null,{"$f":"IF(ISNUMBER(SEARCH(\"Academia/researchers\",'Data extraction-synthesis'!M43)),\"X\",\"\")","v":"X"},"Scoping","Drafting",null,{"$f":"IF(ISNUMBER(SEARCH(\"Clinicians\",'Data extraction-synthesis'!M43)),\"X\",\"\")","v":"X"},"Drafting","Scoping",null,{"$f":"IF(ISNUMBER(SEARCH(\"Representatives of countries and national disease programs\",'Data extraction-synthesis'!M43)),\"X\",\"\")","v":""},{"$nulls":3},{"$f":"IF(ISNUMBER(SEARCH(\"International/public health institution \",'Data extraction-synthesis'!M43)),\"X\",\"\")","v":""},{"$nulls":3},{"$f":"IF(ISNUMBER(SEARCH(\"Experts (unspecific)\",'Data extraction-synthesis'!M43)),\"X\",\"\")","v":""},null,null,{"$f":"IF(ISNUMBER(SEARCH(\"Laboratory experts\",'Data extraction-synthesis'!M43)),\"X\",\"\")","v":""},null,null,{"$f":"IF(ISNUMBER(SEARCH(\"Non-profit sector\",'Data extraction-synthesis'!M43)),\"X\",\"\")","v":""},null,null,{"$f":"IF(ISNUMBER(SEARCH(\"Technical/funding agencies\",'Data extraction-synthesis'!M43)),\"X\",\"\")","v":"X"},"Drafting","Scoping",null,{"$f":"IF(ISNUMBER(SEARCH(\"Policy makers\",'Data extraction-synthesis'!M43)),\"X\",\"\")","v":""},{"$nulls":3},{"$f":"IF(ISNUMBER(SEARCH(\"Implementers\",'Data extraction-synthesis'!M43)),\"X\",\"\")","v":""},{"$nulls":3},{"$f":"IF(ISNUMBER(SEARCH(\"Patient/community advocates\",'Data extraction-synthesis'!M43)),\"X\",\"\")","v":""},{"$nulls":3},{"$f":"IF(ISNUMBER(SEARCH(\"Microbiologists\",'Data extraction-synthesis'!M43)),\"X\",\"\")","v":""},{"$nulls":3},{"$f":"IF(ISNUMBER(SEARCH(\"Modelers\",'Data extraction-synthesis'!M43)),\"X\",\"\")","v":""},null,null,{"$f":"IF(ISNUMBER(SEARCH(\"Health economists\",'Data extraction-synthesis'!M43)),\"X\",\"\")","v":""},null,null,{"$f":"IF(ISNUMBER(SEARCH(\"Donors\",'Data extraction-synthesis'!M43)),\"X\",\"\")","v":""},null,null,{"$f":"IF(ISNUMBER(SEARCH(\"Market experts\",'Data extraction-synthesis'!M43)),\"X\",\"\")","v":""},{"$nulls":3},{"$f":"IF(ISNUMBER(SEARCH(\"Program manager\",'Data extraction-synthesis'!M43)),\"X\",\"\")","v":""},null,null,{"$f":"IF(ISNUMBER(SEARCH(\"Scientific associations\",'Data extraction-synthesis'!M43)),\"X\",\"\")","v":""},{"$nulls":3},{"$f":"IF(ISNUMBER(SEARCH(\"Strategists\",'Data extraction-synthesis'!M43)),\"X\",\"\")","v":""},null,null,{"$f":"IF(ISNUMBER(SEARCH(\"Other\",'Data extraction-synthesis'!M43)),\"X\",\"\")","v":"X"},"Scoping","Drafting"]
["PATH","Target Product Profile: Schistosomiasis Surveillance Diagnostic - schistosoma genus-specific antibody lateral flow test post-elimination surveillance",{"$f":"IF(ISNUMBER(SEARCH(\"Industry (unspecific)\",'Data extraction-synthesis'!M44)),\"X\",\"\")","v":""},null,"",{"$nulls":3},{"$f":"IF(ISNUMBER(SEARCH(\"Test developers\",'Data extraction-synthesis'!M44)),\"X\",\"\")","v":""},null,{"$f":"IF(ISNUMBER(SEARCH(\"Academia/researchers\",'Data extraction-synthesis'!M44)),\"X\",\"\")","v":""},{"$nulls":3},{"$f":"IF(ISNUMBER(SEARCH(\"Clinicians\",'Data extraction-synthesis'!M44)),\"X\",\"\")","v":""},{"$nulls":3},{"$f":"IF(ISNUMBER(SEARCH(\"Representatives of countries and national disease programs\",'Data extraction-synthesis'!M44)),\"X\",\"\")","v":""},{"$nulls":3},{"$f":"IF(ISNUMBER(SEARCH(\"International/public health institution \",'Data extraction-synthesis'!M44)),\"X\",\"\")","v":""},{"$nulls":3},{"$f":"IF(ISNUMBER(SEARCH(\"Experts (unspecific)\",'Data extraction-synthesis'!M44)),\"X\",\"\")","v":""},null,null,{"$f":"IF(ISNUMBER(SEARCH(\"Laboratory experts\",'Data extraction-synthesis'!M44)),\"X\",\"\")","v":""},null,null,{"$f":"IF(ISNUMBER(SEARCH(\"Non-profit sector\",'Data extraction-synthesis'!M44)),\"X\",\"\")","v":""},null,null,{"$f":"IF(ISNUMBER(SEARCH(\"Technical/funding agencies\",'Data extraction-synthesis'!M44)),\"X\",\"\")","v":""},{"$nulls":3},{"$f":"IF(ISNUMBER(SEARCH(\"Policy makers\",'Data extraction-synthesis'!M44)),\"X\",\"\")","v":""},{"$nulls":3},{"$f":"IF(ISNUMBER(SEARCH(\"Implementers\",'Data extraction-synthesis'!M44)),\"X\",\"\")","v":""},{"$nulls":3},{"$f":"IF(ISNUMBER(SEARCH(\"Patient/community advocates\",'Data extraction-synthesis'!M44)),\"X\",\"\")","v":""},{"$nulls":3},{"$f":"IF(ISNUMBER(SEARCH(\"Microbiologists\",'Data extraction-synthesis'!M44)),\"X\",\"\")","v":""},{"$nulls":3},{"$f":"IF(ISNUMBER(SEARCH(\"Modelers\",'Data extraction-synthesis'!M44)),\"X\",\"\")","v":""},null,null,{"$f":"IF(ISNUMBER(SEARCH(\"Health economists\",'Data extraction-synthesis'!M44)),\"X\",\"\")","v":""},null,null,{"$f":"IF(ISNUMBER(SEARCH(\"Donors\",'Data extraction-synthesis'!M44)),\"X\",\"\")","v":""},null,null,{"$f":"IF(ISNUMBER(SEARCH(\"Market experts\",'Data extraction-synthesis'!M44)),\"X\",\"\")","v":""},{"$nulls":3},{"$f":"IF(ISNUMBER(SEARCH(\"Program manager\",'Data extraction-synthesis'!M44)),\"X\",\"\")","v":""},null,null,{"$f":"IF(ISNUMBER(SEARCH(\"Scientific associations\",'Data extraction-synthesis'!M44)),\"X\",\"\")","v":""},{"$nulls":3},{"$f":"IF(ISNUMBER(SEARCH(\"Strategists\",'Data extraction-synthesis'!M44)),\"X\",\"\")","v":""},null,null,{"$f":"IF(ISNUMBER(SEARCH(\"Other\",'Data extraction-synthesis'!M44)),\"X\",\"\")","v":""}]
["WHO, FIND, Medecins sans Frontiers","A Multiplex Multi-Analyte Diagnostic Platform",{"$f":"IF(ISNUMBER(SEARCH(\"Industry (unspecific)\",'Data extraction-synthesis'!M45)),\"X\",\"\")","v":""},null,"",{"$nulls":3},{"$f":"IF(ISNUMBER(SEARCH(\"Test developers\",'Data extraction-synthesis'!M45)),\"X\",\"\")","v":""},null,{"$f":"IF(ISNUMBER(SEARCH(\"Academia/researchers\",'Data extraction-synthesis'!M45)),\"X\",\"\")","v":""},{"$nulls":3},{"$f":"IF(ISNUMBER(SEARCH(\"Clinicians\",'Data extraction-synthesis'!M45)),\"X\",\"\")","v":""},{"$nulls":3},{"$f":"IF(ISNUMBER(SEARCH(\"Representatives of countries and national disease programs\",'Data extraction-synthesis'!M45)),\"X\",\"\")","v":""},{"$nulls":3},{"$f":"IF(ISNUMBER(SEARCH(\"International/public health institution \",'Data extraction-synthesis'!M45)),\"X\",\"\")","v":""},{"$nulls":3},{"$f":"IF(ISNUMBER(SEARCH(\"Experts (unspecific)\",'Data extraction-synthesis'!M45)),\"X\",\"\")","v":""},null,null,{"$f":"IF(ISNUMBER(SEARCH(\"Laboratory experts\",'Data extraction-synthesis'!M45)),\"X\",\"\")","v":""},null,null,{"$f":"IF(ISNUMBER(SEARCH(\"Non-profit sector\",'Data extraction-synthesis'!M45)),\"X\",\"\")","v":""},null,null,{"$f":"IF(ISNUMBER(SEARCH(\"Technical/funding agencies\",'Data extraction-synthesis'!M45)),\"X\",\"\")","v":""},{"$nulls":3},{"$f":"IF(ISNUMBER(SEARCH(\"Policy makers\",'Data extraction-synthesis'!M45)),\"X\",\"\")","v":""},{"$nulls":3},{"$f":"IF(ISNUMBER(SEARCH(\"Implementers\",'Data extraction-synthesis'!M45)),\"X\",\"\")","v":""},{"$nulls":3},{"$f":"IF(ISNUMBER(SEARCH(\"Patient/community advocates\",'Data extraction-synthesis'!M45)),\"X\",\"\")","v":""},{"$nulls":3},{"$f":"IF(ISNUMBER(SEARCH(\"Microbiologists\",'Data extraction-synthesis'!M45)),\"X\",\"\")","v":""},{"$nulls":3},{"$f":"IF(ISNUMBER(SEARCH(\"Modelers\",'Data extraction-synthesis'!M45)),\"X\",\"\")","v":""},null,null,{"$f":"IF(ISNUMBER(SEARCH(\"Health economists\",'Data extraction-synthesis'!M45)),\"X\",\"\")","v":""},null,null,{"$f":"IF(ISNUMBER(SEARCH(\"Donors\",'Data extraction-synthesis'!M45)),\"X\",\"\")","v":""},null,null,{"$f":"IF(ISNUMBER(SEARCH(\"Market experts\",'Data extraction-synthesis'!M45)),\"X\",\"\")","v":""},{"$nulls":3},{"$f":"IF(ISNUMBER(SEARCH(\"Program manager\",'Data extraction-synthesis'!M45)),\"X\",\"\")","v":""},null,null,{"$f":"IF(ISNUMBER(SEARCH(\"Scientific associations\",'Data extraction-synthesis'!M45)),\"X\",\"\")","v":""},{"$nulls":3},{"$f":"IF(ISNUMBER(SEARCH(\"Strategists\",'Data extraction-synthesis'!M45)),\"X\",\"\")","v":""},null,null,{"$f":"IF(ISNUMBER(SEARCH(\"Other\",'Data extraction-synthesis'!M45)),\"X\",\"\")","v":""}]
[null,"Results sorted by phase"]
[null,"Scoping",null,null,{"$f":"COUNTIFS($E$3:$E$46,\"X\",$F$3:$F$46,\"Scoping\") + COUNTIFS($E$3:$E$46,\"X\",$G$3:$G$46,\"Scoping\")+ COUNTIFS($E$3:$E$46,\"X\",$H$3:$H$46,\"Scoping\")","v":11},{"$nulls":5},{"$f":"COUNTIFS($K$3:$K$46,\"X\",$L$3:$L$46,\"Scoping\")+COUNTIFS(K3:K46,\"X\",M3:M46,\"Scoping\")+COUNTIFS(K3:K46,\"X\",N3:N46,\"Scoping\")","v":14},{"$nulls":3},{"$f":"COUNTIFS($O$3:$O$46,\"X\",$P$3:$P$46,\"Scoping\") + COUNTIFS($O$3:$O$46,\"X\",$Q$3:$Q$46,\"Scoping\")+COUNTIFS($O$3:$O$46,\"X\",$R$3:$R$46,\"Scoping\")","v":7},{"$nulls":3},{"$f":"COUNTIFS($S$3:$S$46,\"X\",$T$3:$T$46,\"Scoping\")+COUNTIFS($S$3:$S$46,\"X\",$U$3:$U$46,\"Scoping\")+COUNTIFS($S$3:$S$46,\"X\",$V$3:$V$46,\"Scoping\")","v":5},{"$nulls":3},{"$f":"COUNTIFS($W$3:$W$46,\"X\",$X$3:$X$46,\"Scoping\")+COUNTIFS($W$3:$W$46,\"X\",$Y$3:$Y$46,\"Scoping\")+COUNTIFS($W$3:$W$46,\"X\",$Z$3:$Z$46,\"Scoping\")","v":9},{"$nulls":3},{"$f":"COUNTIFS($AA$3:$AA$46,\"X\",$AB$3:$AB$46,\"Scoping\")+COUNTIFS($AA$3:$AA$46,\"X\",$AC$3:$AC$46,\"Scoping\")","v":1},null,null,{"$f":"COUNTIFS($AD$3:$AD$46,\"X\",$AE$3:$AE$46,\"Scoping\")+COUNTIFS($AD$3:$AD$46,\"X\",$AF$3:$AF$46,\"Scoping\")","v":3},null,null,{"$f":"COUNTIFS($AG$3:$AG$46,\"X\",$AH$3:$AH$46,\"Scoping\")+COUNTIFS($AG$3:$AG$46,\"X\",$AI$3:$AI$46,\"Scoping\")","v":1},null,null,{"$f":"COUNTIFS($AJ$3:$AJ$46,\"X\",$AK$3:$AK$46,\"Scoping\")+COUNTIFS($AJ$3:$AJ$46,\"X\",$AL$3:$AL$46,\"Scoping\")+COUNTIFS($AJ$3:$AJ$46,\"X\",$AM$3:$AM$46,\"Scoping\")","v":2},{"$nulls":3},{"$f":"COUNTIFS($AN$3:$AN$46,\"X\",$AO$3:$AO$46,\"Scoping\")+COUNTIFS($AN$3:$AN$46,\"X\",$AP$3:$AP$46,\"Scoping\")+COUNTIFS(AN3:AN46,\"X\",AQ3:AQ46,\"Scoping\")","v":4},{"$nulls":3},{"$f":"COUNTIFS($AR$3:$AR$46,\"X\",$AS$3:$AS$46,\"Scoping\")+COUNTIFS($AR$3:$AR$46,\"X\",$AT$3:$AT$46,\"Scoping\")+COUNTIFS($AR$3:$AR$46,\"X\",$AU$3:$AU$46,\"Scoping\")","v":2},{"$nulls":3},{"$f":"COUNTIFS($AV$3:$AV$46,\"X\",$AW$3:$AW$46,\"Scoping\")+COUNTIFS($AV$3:$AV$46,\"X\",$AX$3:$AX$46,\"Scoping\")+COUNTIFS($AV$3:$AV$46,\"X\",$AY$3:$AY$46,\"Scoping\")","v":2},{"$nulls":3},{"$f":"COUNTIFS($AZ$3:$AZ$46,\"X\",$BA$3:$BA$46,\"Scoping\")+COUNTIFS($AZ$3:$AZ$46,\"X\",$BC$3:$BC$46,\"Scoping\")+COUNTIFS(AZ3:AZ46,\"X\",BB3:BB46,\"Scoping\")","v":2},{"$nulls":3},{"$f":"COUNTIFS($BD$3:$BD$46,\"X\",$BE$3:$BE$46,\"Scoping\")+COUNTIFS($BD$3:$BD$46,\"X\",$BF$3:$BF$46,\"Scoping\")","v":1},null,null,{"$f":"COUNTIFS($BG$3:$BG$46,\"X\",$BH$3:$BH$46,\"Scoping\")+COUNTIFS($BG$3:$BG$46,\"X\",$BI$3:$BI$46,\"Scoping\")","v":0},null,null,{"$f":"COUNTIFS($BJ$3:$BJ$46,\"X\",$BK$3:$BK$46,\"Scoping\")+COUNTIFS($BJ$3:$BJ$46,\"X\",$BL$3:$BL$46,\"Scoping\")","v":2},null,null,{"$f":"COUNTIFS($BM$3:$BM$46,\"X\",$BN$3:$BN$46,\"Scoping\")+COUNTIFS($BM$3:$BM$46,\"X\",$BO$3:$BO$46,\"Scoping\")+COUNTIFS($BM$3:$BM$46,\"X\",$BP$3:$BP$46,\"Scoping\")","v":2},{"$nulls":3},{"$f":"COUNTIFS($BQ$3:$BQ$46,\"X\",$BR$3:$BR$46,\"Scoping\")+COUNTIFS($BQ$3:$BQ$46,\"X\",$BS$3:$BS$46,\"Scoping\")","v":1},null,null,{"$f":"COUNTIFS($BT$3:$BT$46,\"X\",$BU$3:$BU$46,\"Drafting\")+COUNTIFS($BT$3:$BT$46,\"X\",$BV$3:$BV$46,\"Scoping\")+COUNTIFS(BT3:BT46,\"X\",BW3:BW46,\"Scoping\")","v":1},{"$nulls":3},{"$f":"COUNTIFS($BX$3:$BX$46,\"X\",$BY$3:$BY$46,\"Scoping\")+COUNTIFS($BX$3:$BX$46,\"X\",$BZ$3:$BZ$46,\"Scoping\")","v":1},null,null,{"$f":"COUNTIFS($CA$3:$CA$46,\"X\",$CB$3:$CB$46,\"Scoping\")+COUNTIFS($CA$3:$CA$46,\"X\",$CC$3:$CC$46,\"Scoping\")","v":2}]
[null,"Drafting",null,null,{"$f":"COUNTIFS($E$3:$E$46,\"X\",$F$3:$F$46,\"Drafting\")+ COUNTIFS($E$3:$E$46,\"X\",$G$3:$G$46,\"Drafting\")+ COUNTIFS($E$3:$E$46,\"X\",$H$3:$H$46,\"Drafting\")","v":11},{"$nulls":5},{"$f":"COUNTIFS(K3:K46,\"X\",L3:L46,\"Drafting\")+COUNTIFS(K3:K46,\"X\",M3:M46,\"Drafting\")+COUNTIFS(K3:K46,\"X\",N3:N46,\"Drafting\")","v":15},{"$nulls":3},{"$f":"COUNTIFS($O$3:$O$46,\"X\",$P$3:$P$46,\"Drafting\")+ COUNTIFS($O$3:$O$46,\"X\",$Q$3:$Q$46,\"Drafting\")+COUNTIFS($O$3:$O$46,\"X\",$R$3:$R$46,\"Drafting\")","v":8},{"$nulls":3},{"$f":"COUNTIFS($S$3:$S$46,\"X\",$T$3:$T$46,\"Drafting\")+COUNTIFS($S$3:$S$46,\"X\",$U$3:$U$46,\"Drafting\")+COUNTIFS($S$3:$S$46,\"X\",$V$3:$V$46,\"Drafting\")","v":4},{"$nulls":3},{"$f":"COUNTIFS($W$3:$W$46,\"X\",$X$3:$X$46,\"Drafting\")+COUNTIFS($W$3:$W$46,\"X\",$Y$3:$Y$46,\"Drafting\")+COUNTIFS($W$3:$W$46,\"X\",$Z$3:$Z$46,\"Drafting\")","v":12},{"$nulls":3},{"$f":"COUNTIFS($AA$3:$AA$46,\"X\",$AB$3:$AB$46,\"Drafting\")+COUNTIFS($AA$3:$AA$46,\"X\",$AC$3:$AC$46,\"Drafting\")","v":3},null,null,{"$f":"COUNTIFS($AD$3:$AD$46,\"X\",$AE$3:$AE$46,\"Drafting\")+COUNTIFS($AD$3:$AD$46,\"X\",$AF$3:$AF$46,\"Drafting\")","v":5},null,null,{"$f":"COUNTIFS($AG$3:$AG$46,\"X\",$AH$3:$AH$46,\"Drafting\")+COUNTIFS($AG$3:$AG$46,\"X\",$AI$3:$AI$46,\"Drafting\")","v":2},null,null,{"$f":"COUNTIFS($AJ$3:$AJ$46,\"X\",$AK$3:$AK$46,\"Drafting\")+COUNTIFS($AJ$3:$AJ$46,\"X\",$AL$3:$AL$46,\"Drafting\")+COUNTIFS($AJ$3:$AJ$46,\"X\",$AM$3:$AM$46,\"Drafting\")","v":3},{"$nulls":3},{"$f":"COUNTIFS($AN$3:$AN$46,\"X\",$AO$3:$AO$46,\"Drafting\")+COUNTIFS($AN$3:$AN$46,\"X\",$AP$3:$AP$46,\"Drafting\")+COUNTIFS(AN3:AN46,\"X\",AQ3:AQ46,\"Drafting\")","v":5},{"$nulls":3},{"$f":"COUNTIFS($AR$3:$AR$46,\"X\",$AS$3:$AS$46,\"Drafting\")+COUNTIFS($AR$3:$AR$46,\"X\",$AT$3:$AT$46,\"Drafting\")+COUNTIFS($AR$3:$AR$46,\"X\",$AU$3:$AU$46,\"Drafting\")","v":2},{"$nulls":3},{"$f":"COUNTIFS($AV$3:$AV$46,\"X\",$AW$3:$AW$46,\"Drafting\")+COUNTIFS($AV$3:$AV$46,\"X\",$AX$3:$AX$46,\"Drafting\")+COUNTIFS($AV$3:$AV$46,\"X\",$AY$3:$AY$46,\"Drafting\")","v":1},{"$nulls":3},{"$f":"COUNTIFS($AZ$3:$AZ$46,\"X\",$BA$3:$BA$46,\"Drafting\")+COUNTIFS($AZ$3:$AZ$46,\"X\",$BC$3:$BC$46,\"Drafting\")+COUNTIFS(AZ3:AZ46,\"X\",BB3:BB46,\"Drafting\")","v":4},{"$nulls":3},{"$f":"COUNTIFS($BD$3:$BD$46,\"X\",$BE$3:$BE$46,\"Drafting\")+COUNTIFS($BD$3:$BD$46,\"X\",$BF$3:$BF$46,\"Drafting\")","v":1},null,null,{"$f":"COUNTIFS($BG$3:$BG$46,\"X\",$BH$3:$BH$46,\"Drafting\")+COUNTIFS($BG$3:$BG$46,\"X\",$BI$3:$BI$46,\"Drafting\")","v":2},null,null,{"$f":"COUNTIFS($BJ$3:$BJ$46,\"X\",$BK$3:$BK$46,\"Drafting\")+COUNTIFS($BJ$3:$BJ$46,\"X\",$BL$3:$BL$46,\"Drafting\")","v":3},null,null,{"$f":"COUNTIFS($BM$3:$BM$46,\"X\",$BN$3:$BN$46,\"Drafting\")+COUNTIFS($BM$3:$BM$46,\"X\",$BO$3:$BO$46,\"Drafting\")+COUNTIFS($BM$3:$BM$46,\"X\",$BP$3:$BP$46,\"Drafting\")","v":1},{"$nulls":3},{"$f":"COUNTIFS($BQ$3:$BQ$46,\"X\",$BR$3:$BR$46,\"Drafting\")+COUNTIFS($BQ$3:$BQ$46,\"X\",$BS$3:$BS$46,\"Drafting\")","v":2},null,null,{"$f":"COUNTIFS($BT$3:$BT$46,\"X\",$BU$3:$BU$46,\"Scoping\")+COUNTIFS($BT$3:$BT$46,\"X\",$BV$3:$BV$46,\"Drafting\")+COUNTIFS(BT3:BT46,\"X\",BW3:BW46,\"Drafting\")","v":3},{"$nulls":3},{"$f":"COUNTIFS($BX$3:$BX$46,\"X\",$BY$3:$BY$46,\"Drafting\")+COUNTIFS($BX$3:$BX$46,\"X\",$BZ$3:$BZ$46,\"Drafting\")","v":1},null,null,{"$f":"COUNTIFS($CA$3:$CA$46,\"X\",$CB$3:$CB$46,\"Drafting\")+COUNTIFS($CA$3:$CA$46,\"X\",$CC$3:$CC$46,\"Drafting\")","v":2}]
[null,"Consensus-building",null,null,{"$f":"COUNTIFS($E$3:$E$46,\"X\",$F$3:$F$46,\"Consensus-building\")+ COUNTIFS($E$3:$E$46,\"X\",$G$3:$G$46,\"Consensus-building\")+ COUNTIFS($E$3:$E$46,\"X\",$H$3:$H$46,\"Consensus-building\")","v":14},{"$nulls":5},{"$f":"COUNTIFS(K3:K46,\"X\",L3:L46,\"Consensus-building\")+COUNTIFS(K3:K46,\"X\",M3:M46,\"Consensus-building\")+COUNTIFS(K3:K46,\"X\",N3:N46,\"Consensus-building\")","v":14},{"$nulls":3},{"$f":"COUNTIFS($O$3:$O$46,\"X\",$P$3:$P$46,\"Consensus-building\")+ COUNTIFS($O$3:$O$46,\"X\",$Q$3:$Q$46,\"Consensus-building\")+COUNTIFS($O$3:$O$46,\"X\",$R$3:$R$46,\"Consensus-building\")","v":8},{"$nulls":3},{"$f":"COUNTIFS($S$3:$S$46,\"X\",$T$3:$T$46,\"Consensus-building\")+COUNTIFS($S$3:$S$46,\"X\",$U$3:$U$46,\"Consensus-building\")+COUNTIFS($S$3:$S$46,\"X\",$V$3:$V$46,\"Consensus-building\")","v":8},{"$nulls":3},{"$f":"COUNTIFS($W$3:$W$46,\"X\",$X$3:$X$46,\"Consensus-building\")+COUNTIFS($W$3:$W$46,\"X\",$Y$3:$Y$46,\"Consensus-building\")+COUNTIFS($W$3:$W$46,\"X\",$Z$3:$Z$46,\"Consensus-building\")","v":12},{"$nulls":3},{"$f":"COUNTIFS($AA$3:$AA$46,\"X\",$AB$3:$AB$46,\"Consensus-building\")+COUNTIFS($AA$3:$AA$46,\"X\",$AC$3:$AC$46,\"Consensus-building\")","v":3},null,null,{"$f":"COUNTIFS($AD$3:$AD$46,\"X\",$AE$3:$AE$46,\"Consensus-building\")+COUNTIFS($AD$3:$AD$46,\"X\",$AF$3:$AF$46,\"Consensus-building\")","v":3},null,null,{"$f":"COUNTIFS($AG$3:$AG$46,\"X\",$AH$3:$AH$46,\"Consensus-building\")+COUNTIFS($AG$3:$AG$46,\"X\",$AI$3:$AI$46,\"Consensus-building\")","v":4},null,null,{"$f":"COUNTIFS($AJ$3:$AJ$46,\"X\",$AK$3:$AK$46,\"Consensus-building\")+COUNTIFS($AJ$3:$AJ$46,\"X\",$AL$3:$AL$46,\"Consensus-building\")+COUNTIFS($AJ$3:$AJ$46,\"X\",$AM$3:$AM$46,\"Consensus-building\")","v":4},{"$nulls":3},{"$f":"COUNTIFS($AN$3:$AN$46,\"X\",$AO$3:$AO$46,\"Consensus-building\")+COUNTIFS($AN$3:$AN$46,\"X\",$AP$3:$AP$46,\"Consensus-building\")+COUNTIFS(AN3:AN46,\"X\",AQ3:AQ46,\"Consensus-building\")","v":4},{"$nulls":3},{"$f":"COUNTIFS($AR$3:$AR$46,\"X\",$AS$3:$AS$46,\"Consensus-building\")+COUNTIFS($AR$3:$AR$46,\"X\",$AT$3:$AT$46,\"Consensus-building\")+COUNTIFS($AR$3:$AR$46,\"X\",$AU$3:$AU$46,\"Consensus-building\")","v":5},{"$nulls":3},{"$f":"COUNTIFS($AV$3:$AV$46,\"X\",$AW$3:$AW$46,\"Consensus-building\")+COUNTIFS($AV$3:$AV$46,\"X\",$AX$3:$AX$46,\"Consensus-building\")+COUNTIFS($AV$3:$AV$46,\"X\",$AY$3:$AY$46,\"Consensus-building\")","v":3},{"$nulls":3},{"$f":"COUNTIFS($AZ$3:$AZ$46,\"X\",$BA$3:$BA$46,\"Consensus-building\")+COUNTIFS($AZ$3:$AZ$46,\"X\",$BC$3:$BC$46,\"Consensus-building\")+COUNTIFS(AZ3:AZ46,\"X\",BB3:BB46,\"Consensus-building\")","v":2},{"$nulls":3},{"$f":"COUNTIFS($BD$3:$BD$46,\"X\",$BE$3:$BE$46,\"Consensus-building\")+COUNTIFS($BD$3:$BD$46,\"X\",$BF$3:$BF$46,\"Consensus-building\")","v":1},null,null,{"$f":"COUNTIFS($BG$3:$BG$46,\"X\",$BH$3:$BH$46,\"Consensus-building\")+COUNTIFS($BG$3:$BG$46,\"X\",$BI$3:$BI$46,\"Consensus-building\")","v":2},null,null,{"$f":"COUNTIFS($BJ$3:$BJ$46,\"X\",$BK$3:$BK$46,\"Consensus-building\")+COUNTIFS($BJ$3:$BJ$46,\"X\",$BL$3:$BL$46,\"Consensus-building\")","v":1},null,null,{"$f":"COUNTIFS($BM$3:$BM$46,\"X\",$BN$3:$BN$46,\"Consensus-building\")+COUNTIFS($BM$3:$BM$46,\"X\",$BO$3:$BO$46,\"Consensus-building\")+COUNTIFS($BM$3:$BM$46,\"X\",$BP$3:$BP$46,\"Consensus-building\")","v":1},{"$nulls":3},{"$f":"COUNTIFS($BQ$3:$BQ$46,\"X\",$BR$3:$BR$46,\"Consensus-building\")+COUNTIFS($BQ$3:$BQ$46,\"X\",$BS$3:$BS$46,\"Consensus-building\")","v":2},null,null,{"$f":"COUNTIFS($BT$3:$BT$46,\"X\",$BU$3:$BU$46,\"Consensus-building\")+COUNTIFS($BT$3:$BT$46,\"X\",$BV$3:$BV$46,\"Consensus-building\")+COUNTIFS(BT3:BT46,\"X\",BW3:BW46,\"Consensus-building\")","v":2},{"$nulls":3},{"$f":"COUNTIFS($BX$3:$BX$46,\"X\",$BY$3:$BY$46,\"Consensus-building\")+COUNTIFS($BX$3:$BX$46,\"X\",$BZ$3:$BZ$46,\"Consensus-building\")","v":0},null,null,{"$f":"COUNTIFS($CA$3:$CA$46,\"X\",$CB$3:$CB$46,\"Consensus-building\")+COUNTIFS($CA$3:$CA$46,\"X\",$CC$3:$CC$46,\"Consensus-building\")","v":1}]
[]
[]
[]
[{"$nulls":6},"Academia/researchers","Industry representatives","Clinicians","Representatives of countries and national disease programs","International/public health institution (e.g. WHO) ","Experts (unspecific)","Laboratory experts","Non-profit sector","Technical/funding agencies ","Policy makers","Implementers","Patient/community advocates","Microbiologists","Modelers","Health economists","Donors","Market experts"," Program manager","Scientific associations","Strategists","Other"]
[{"$nulls":4},"Scoping",null,{"$f":"K48","v":14},{"$f":"E48","v":11},{"$f":"O48","v":7},{"$f":"S48","v":5},{"$f":"W48","v":9},{"$f":"AA48","v":1},{"$f":"AD48","v":3},{"$f":"AG48","v":1},{"$f":"AJ48","v":2},{"$f":"AN48","v":4},{"$f":"AR48","v":2},{"$f":"AV48","v":2},{"$f":"AZ48","v":2},{"$f":"BD48","v":1},{"$f":"BG48","v":0},{"$f":"BJ48","v":2},{"$f":"BM48","v":2},{"$f":"BQ48","v":1},{"$f":"BT48","v":1},{"$f":"BX48","v":1},{"$f":"CA48","v":2}]
[{"$nulls":4},"Drafting",null,{"$f":"K49","v":15},{"$f":"E49","v":11},{"$f":"O49","v":8},{"$f":"S49","v":4},{"$f":"W49","v":12},{"$f":"AA49","v":3},{"$f":"AD49","v":5},{"$f":"AG49","v":2},{"$f":"AJ49","v":3},{"$f":"AN49","v":5},{"$f":"AR49","v":2},{"$f":"AV49","v":1},{"$f":"AZ49","v":4},{"$f":"BD49","v":1},{"$f":"BG49","v":2},{"$f":"BJ49","v":3},{"$f":"BM49","v":1},{"$f":"BQ49","v":2},{"$f":"BT49","v":3},{"$f":"BX49","v":1},{"$f":"CA49","v":2}]
[{"$nulls":4},"Consensus-building",null,{"$f":"K50","v":14},{"$f":"E50","v":14},{"$f":"O50","v":8},{"$f":"S50","v":8},{"$f":"W50","v":12},{"$f":"AA50","v":3},{"$f":"AD50","v":3},{"$f":"AG50","v":4},{"$f":"AJ50","v":4},{"$f":"AN50","v":4},{"$f":"AR50","v":5},{"$f":"AV50","v":3},{"$f":"AZ50","v":2},{"$f":"BD50","v":1},{"$f":"BG50","v":2},{"$f":"BJ50","v":1},{"$f":"BM50","v":1},{"$f":"BQ50","v":2},{"$f":"BT50","v":2},{"$f":"BX50","v":0},{"$f":"CA50","v":1}]
[{"$nulls":6},{"$f":"G55/44","v":{"v":0.3181818181818182,"d":"32%"}},{"$f":"H55/44","v":{"v":0.25,"d":"25%"}},{"$f":"I55/44","v":{"v":0.1590909090909091,"d":"16%"}},{"$f":"J55/44","v":{"v":0.11363636363636363,"d":"11%"}},{"v":0.20454545454545456,"d":"20%"},{"v":0.022727272727272728,"d":"2%"},{"v":0.06818181818181818,"d":"7%"},{"v":0.022727272727272728,"d":"2%"},{"v":0.045454545454545456,"d":"5%"},{"v":0.09090909090909091,"d":"9%"},{"v":0.045454545454545456,"d":"5%"},{"v":0.045454545454545456,"d":"5%"},{"v":0.045454545454545456,"d":"5%"},{"v":0.022727272727272728,"d":"2%"},{"v":0,"d":"0%"},{"v":0.045454545454545456,"d":"5%"},{"v":0.045454545454545456,"d":"5%"},{"v":0.022727272727272728,"d":"2%"},{"v":0.022727272727272728,"d":"2%"},{"v":0.022727272727272728,"d":"2%"},{"v":0.045454545454545456,"d":"5%"}]
[{"$nulls":6},{"$f":"G56/44","v":{"v":0.3409090909090909,"d":"34%"}},{"$f":"H56/44","v":{"v":0.25,"d":"25%"}},{"$f":"I56/44","v":{"v":0.18181818181818182,"d":"18%"}},{"v":0.09090909090909091,"d":"9%"},{"v":0.2727272727272727,"d":"27%"},{"v":0.06818181818181818,"d":"7%"},{"v":0.11363636363636363,"d":"11%"},{"v":0.045454545454545456,"d":"5%"},{"v":0.06818181818181818,"d":"7%"},{"v":0.11363636363636363,"d":"11%"},{"v":0.045454545454545456,"d":"5%"},{"v":0.022727272727272728,"d":"2%"},{"v":0.09090909090909091,"d":"9%"},{"v":0.022727272727272728,"d":"2%"},{"v":0.045454545454545456,"d":"5%"},{"v":0.06818181818181818,"d":"7%"},{"v":0.022727272727272728,"d":"2%"},{"v":0.045454545454545456,"d":"5%"},{"v":0.06818181818181818,"d":"7%"},{"v":0.022727272727272728,"d":"2%"},{"v":0.045454545454545456,"d":"5%"}]
[{"$nulls":6},{"$f":"G57/44","v":{"v":0.3181818181818182,"d":"32%"}},{"$f":"H57/44","v":{"v":0.3181818181818182,"d":"32%"}},{"v":0.18181818181818182,"d":"18%"},{"v":0.18181818181818182,"d":"18%"},{"v":0.2727272727272727,"d":"27%"},{"v":0.06818181818181818,"d":"7%"},{"v":0.06818181818181818,"d":"7%"},{"v":0.09090909090909091,"d":"9%"},{"v":0.09090909090909091,"d":"9%"},{"v":0.09090909090909091,"d":"9%"},{"v":0.11363636363636363,"d":"11%"},{"v":0.06818181818181818,"d":"7%"},{"v":0.045454545454545456,"d":"5%"},{"v":0.022727272727272728,"d":"2%"},{"v":0.045454545454545456,"d":"5%"},{"v":0.022727272727272728,"d":"2%"},{"v":0.022727272727272728,"d":"2%"},{"v":0.045454545454545456,"d":"5%"},{"v":0.045454545454545456,"d":"5%"},{"v":0,"d":"0%"},{"v":0.022727272727272728,"d":"2%"}]

{"sheet":"Transparency checklist","index":7,"n_rows":62,"n_cols":48,"rows_kept":62,"merged":[[1,0,2,0]]}
[null,"Title",{"$nulls":45},"Title"]
[null,"How to read this Excel worksheet: 1) For each included TPP we conducted a transparency assessment; 2) Based on the transparency score we sorted TPPs from the highested to the lowest; 3) We converted YES/NO answer to symbols in order to make it more understandable in Additional File 3:Table 3:4"]
[]
["Transparency checklist","Update on Zika Diagnostic Tests and WHO's Related Activities","Target Product Profile of a Molecular Drug-Susceptibility Test for Use in Microscopy Centers","Defining the needs for next generation assays for tuberculosis","Point-of-Care Malaria Infection Detection Test For rapid detection of low-density, subclinical malaria infections","Defining the next generation of Plasmodium vivax diagnostic tests for control and elimination: Target product profiles","Target Product Profile for a Diagnostic Assay to Differentiate between Bacterial and Non-Bacterial Infections to Guide Antimicrobials Use in Resource-Limited Settings: An Expert Consensus","High-priority target product profile for hepatitis C diagnosis in decentralized settings: Report of a consensus meeting. ","Matching diagnostics development to clinical need: Target product profile development for a point of care test for community-acquired lower respiratory tract infection","Diagnostic tools for soil-transmitted helminths control and elimination programs: a pathway for diagnostic product development","Molecular assays for antimalarial drug resistance surveillance: A target product profile","Target Product Profile (TPP) for Chagas Disease Point-of-Care Diagnosis and Assessment of Response to Treatmen","Optimising diagnosis of viraemic hepatitis C infection: the development of a target product profile","A diagnostics platform for the integrated mapping, monitoring, and surveillance of neglected tropical diseases: Rationale and target product profiles","Advancing prevention of sexually transmitted infections through point-of-care testing: target product profiles and landscape analysis","Target product profiles for the diagnosis of Taenia solium taeniasis, neurocysticercosis and porcine cysticercosis","Target Product Profile for Tests for Recent HIV Infection","Target Product Profile: Rapid test for diagnosis of malaria and screening for hyman African trypanosomiasis (HAT)","Target Product Profile: HIV Self-Test Version 4.1: A White Paper on the Evaluation of Current HIV Rapid Tests and Development of Core Specifications for Next-Generation HIV Tests","Diagnostics for neglected tropical diseases: Defining the best tools through target product profiles","Target Product Profile: Schistosomiasis Surveillance Diagnostic","UNICEF Target Product Profile Rapid E.coli Detection (version 2.0)","UNICEF Target Product Profile Rapid E.coli Detection (version 1.4)","High-priority target product profile for new tubercolosis diagnostics: report of a consensus meeting","Development of a Target Product Profile (TPP) and framework for evaluation for a test predicting progression from tubercolosis infection to active disease","Specifications for a rapid diagnostic test for meningitis African meningitis belt","Target Product Profile for Zaire ebolavirus rapid,simple test to be used in the control of the Ebola outbreak in West Africa","Report of WHO-FIND meeting on diagnostics for Buruli ulcer","Taenia solium taeniasis/cysticercosis diagnostic tools. Report of a stakeholder meeting","New diagnostic tools in schistosomiasis","Zika Virus Diagnostics: Target Product Profiles & Supply Update","Pneumonia Acute Respiratory Infection Diagnostic Aid-Target Product Profile Introduction","Assessing the Dengue Diagnosis Capability Gap in the Military Health System","Target Product Profile: Schistosomiasis Surveillance Diagnostic Lateral Flow Test CAA antigen","Target Product Profile: Trachoma Surveillance Diagnostic-Post-Elimination Surveillance Antibody Lateral Flow Test","Target Product Profile (TPP) - Point-of-Care HIV Viral Load Test","Target Product Profile (TPP)- Point of care CD4 test","Target Product Profile: Point of care EID test","Target Product Profile (TPP): Combined HIV/Syphilis Test","Incorporating user needs into product development for improved infection detection for malaria elimination programs","Target Product Profile: Screening test for human African trypanosomiasis (HAT)","Target Product Profile: Trachoma surveillance diagnostic-antigen lateral flow test","Defining product requirements for field deployable yellow fever tests","Target Product Profile: Schistosomiasis Surveillance Diagnostic - schistosoma genus-specific antibody lateral flow test post-elimination surveillance","A Multiplex Multi-Analyte Diagnostic Platform"]
["Study mentions type of input sources considered to populate the TPP","YES","YES","YES","YES","YES","YES","YES","YES","YES","YES","YES","YES","YES","YES","YES","YES","NO","YES","YES","YES","NO","NO","YES","YES","NO","NO","YES","YES","NO","YES","YES","YES","YES","YES","NO","NO","NO","NO","YES","NO","YES","YES","YES","YES"]
["Study quotes specific literature considered to populate the TPP","NO","YES","NO","YES","NO","YES","YES","NO","YES","YES","NO","YES","NO","NO","NO","NO","NO","YES","NO","YES","NO","NO","YES","NO","NO","NO","NO","NO","NO","NO","NO","NO","YES","YES","NO","NO","NO","NO","NO","NO","YES","NO","YES","NO"]
["Study mentions type of input sources considered during the scoping phase","NO","YES","YES","NO","YES","YES","YES","YES","YES","YES","NO","YES","NO","YES","YES","YES","NO","NO","YES","NO","NO","NO","YES","NO","NO","NO","YES","YES","NO","YES","YES","YES","NO","NO","NO","NO","NO","NO","YES","NO","NO","YES","NO","NO"]
["Study describes decision-making steps underlying the development of a TPP","YES","YES","YES","NO","YES","YES","YES","YES","YES","YES","YES","YES","NO","YES","YES","YES","YES","YES","YES","NO","NO","NO","YES","YES","NO","NO","YES","YES","NO","YES","YES","YES","NO","NO","NO","NO","NO","NO","YES","YES","NO","YES","NO","YES"]
["Study reports types of stakeholders that took part in the consultative process","YES","YES","YES","NO","YES","YES","YES","YES","YES","YES","NO","YES","YES","YES","YES","NO","YES","NO","YES","NO","NO","NO","YES","YES","NO","NO","NO","YES","NO","YES","YES","YES","NO","NO","NO","NO","NO","NO","YES","YES","NO","YES","NO","NO"]
["Study lists the name of the organizations stakeholders are part of ","NO","NO","NO","NO","NO","NO","YES","NO","YES","YES","YES","NO","NO","YES","NO","YES","NO","NO","NO","NO","NO","NO","YES","YES","NO","YES","YES","YES","NO","NO","NO","NO","NO","NO","NO","NO","NO","NO","NO","NO","NO","NO","NO","NO"]
["Study lists the name of each stakeholders invovled in the consultative process","NO","NO","NO","NO","NO","NO","YES","NO","YES","YES","NO","NO","NO","YES","NO","YES","NO","NO","NO","NO","NO","NO","YES","YES","NO","NO","YES","YES","NO","NO","NO","NO","NO","NO","NO","NO","NO","NO","NO","NO","NO","NO","NO","NO"]
["Study reports the rationale underlying inviting certain stakeholders","NO","NO","NO","NO","NO","YES","NO","NO","NO","YES","NO","NO","NO","NO","NO","NO","NO","NO","NO","NO","NO","NO","NO","YES","NO","NO","NO","NO","NO","NO","NO","NO","NO","NO","NO","NO","NO","NO","NO","NO","NO","YES","NO","NO"]
["Study specifies funding body","NO","YES","YES","YES","YES","YES","NO","YES","NO","NO","YES","YES","YES","NO","NO","YES","NO","YES","YES","NO","NO","NO","YES","NO","NO","NO","NO","NO","YES","NO","NO","YES","NO","NO","NO","NO","NO","NO","NO","NO","NO","YES","NO","NO",{"$f":"COUNTIF(B13:AS13,\"NO\")","v":28}]
["Transparency score",{"$f":"COUNTIF(B5:B13,\"YES\")","v":3},6,5,3,5,7,7,5,7,8,4,6,3,6,4,6,2,4,5,2,0,0,8,6,0,1,5,6,1,4,4,5,2,2,0,0,0,0,4,2,2,6,2,2]
["AAS",28,{"$nulls":5},27,null,26,25,{"$nulls":3},24,23,null,22,null,null,19,20,21,null,18,17,16,15,14,null,{"$f":"AF15+1","v":13},12,null,{"$f":"AI15+1","v":11},10,9,8,7,6,5,4,{"$f":"AR15+1","v":3},null,2,null,1]
["Conflicts?",{"$f":"IF(B14=B15,\"\",\"YES\")","v":"YES"},"YES","YES","YES","YES","YES","YES","YES","YES","YES","YES","YES","YES","YES","YES","YES","YES","YES","YES","YES","YES","YES","YES","YES","YES","YES","YES","YES","YES","YES","YES","YES","YES","YES","YES","YES","YES","YES","YES","YES","YES","YES","",{"$f":"IF(#REF!=AS15,\"\",\"YES\")","v":{"$error":"#REF!"}}]
[]
[{"$nulls":4},"Study mentions type of input sources considered to populate the TPP","Study quotes specific literature considered to populate the TPP","Study mentions type of input sources considered during the scoping phase","Study describes decision-making steps underlying the development of a TPP","Study reports types of stakeholders that took part in the consultative process","Study lists the name of the organizations stakeholders are part of ","Study lists the name of each stakeholders invovled in the consultative process","Study reports the rationale underlying inviting certain stakeholders","Study specifies funding body","Transparency score"]
[{"$nulls":3},"Molecular assays for antimalarial drug resistance surveillance: A target product profile","YES","YES","YES","YES","YES","YES","YES","YES","NO",{"$f":"COUNTIF(E19:M19,\"YES\")","v":8}]
[{"$nulls":3},"High-priority target product profile for new tubercolosis diagnostics: report of a consensus meeting","YES","YES","YES","YES","YES","YES","YES","NO","YES",{"$f":"COUNTIF(E20:M20,\"YES\")","v":8}]
[{"$nulls":3},"Target Product Profile for a Diagnostic Assay to Differentiate between Bacterial and Non-Bacterial Infections to Guide Antimicrobials Use in Resource-Limited Settings: An Expert Consensus","YES","YES","YES","YES","YES","NO","NO","YES","YES",{"$f":"COUNTIF(E21:M21,\"YES\")","v":7}]
[{"$nulls":3},"High-priority target product profile for hepatitis C diagnosis in decentralized settings: Report of a consensus meeting. ","YES","YES","YES","YES","YES","YES","YES","NO","NO",7]
[{"$nulls":3},"Diagnostic tools for soil-transmitted helminths control and elimination programs: a pathway for diagnostic product development","YES","YES","YES","YES","YES","YES","YES","NO","NO",7]
[{"$nulls":3},"Target Product Profile of a Molecular Drug-Susceptibility Test for Use in Microscopy Centers","YES","YES","YES","YES","YES","NO","NO","NO","YES",6]
[{"$nulls":3},"Optimising diagnosis of viraemic hepatitis C infection: the development of a target product profile","YES","YES","YES","YES","YES","NO","NO","NO","YES",6]
[{"$nulls":3},"Advancing prevention of sexually transmitted infections through point-of-care testing: target product profiles and landscape analysis","YES","NO","YES","YES","YES","YES","YES","NO","NO",6]
[{"$nulls":3},"Target Product Profile for Tests for Recent HIV Infection","YES","NO","YES","YES","NO","YES","YES","NO","YES",6]
[{"$nulls":3},"Development of a Target Product Profile (TPP) and framework for evaluation for a test predicting progression from tubercolosis infection to active disease","YES","NO","NO","YES","YES","YES","YES","YES","NO",6]
[{"$nulls":3},"Taenia solium taeniasis/cysticercosis diagnostic tools. Report of a stakeholder meeting","YES","NO","YES","YES","YES","YES","YES","NO","NO",6]
[{"$nulls":3},"Defining product requirements for field deployable yellow fever tests","YES","NO","YES","YES","YES","NO","NO","YES","YES",6]
[{"$nulls":3},"Defining the needs for next generation assays for tuberculosis","YES","NO","YES","YES","YES","NO","NO","NO","YES",5]
[{"$nulls":3},"Defining the next generation of Plasmodium vivax diagnostic tests for control and elimination: Target product profiles","YES","NO","YES","YES","YES","NO","NO","NO","YES",5]
[{"$nulls":3},"Matching diagnostics development to clinical need: Target product profile development for a point of care test for community-acquired lower respiratory tract infection","YES","NO","YES","YES","YES","NO","NO","NO","YES",5]
[{"$nulls":3},"Diagnostics for neglected tropical diseases: Defining the best tools through target product profiles","YES","NO","YES","YES","YES","NO","NO","NO","YES",5]
[{"$nulls":3},"Report of WHO-FIND meeting on diagnostics for Buruli ulcer","YES","NO","YES","YES","NO","YES","YES","NO","NO",5]
[{"$nulls":3},"Assessing the Dengue Diagnosis Capability Gap in the Military Health System","YES","NO","YES","YES","YES","NO","NO","NO","YES",5]
[{"$nulls":3},"Target Product Profile (TPP) for Chagas Disease Point-of-Care Diagnosis and Assessment of Response to Treatmen","YES","NO","NO","YES","NO","YES","NO","NO","YES",4]
[{"$nulls":3},"Target product profiles for the diagnosis of Taenia solium taeniasis, neurocysticercosis and porcine cysticercosis","YES","NO","YES","YES","YES","NO","NO","NO","NO",4]
[{"$nulls":3},"Target Product Profile: HIV Self-Test Version 4.1: A White Paper on the Evaluation of Current HIV Rapid Tests and Development of Core Specifications for Next-Generation HIV Tests","YES","YES","NO","YES","NO","NO","NO","NO","YES",4]
[{"$nulls":3},"Zika Virus Diagnostics: Target Product Profiles & Supply Update","YES","NO","YES","YES","YES","NO","NO","NO","NO",4]
[{"$nulls":3},"Pneumonia Acute Respiratory Infection Diagnostic Aid-Target Product Profile Introduction","YES","NO","YES","YES","YES","NO","NO","NO","NO",4]
[{"$nulls":3},"Incorporating user needs into product development for improved infection detection for malaria elimination programs","YES","NO","YES","YES","YES","NO","NO","NO","NO",4]
[{"$nulls":3},"Update on Zika Diagnostic Tests and WHO's Related Activities","YES","NO","NO","YES","YES","NO","NO","NO","NO",3]
[{"$nulls":3},"Point-of-Care Malaria Infection Detection Test For rapid detection of low-density, subclinical malaria infections","YES","YES","NO","NO","NO","NO","NO","NO","YES",3]
[{"$nulls":3},"A diagnostics platform for the integrated mapping, monitoring, and surveillance of neglected tropical diseases: Rationale and target product profiles","YES","NO","NO","NO","YES","NO","NO","NO","YES",3]
[{"$nulls":3},"Target Product Profile: Rapid test for diagnosis of malaria and screening for hyman African trypanosomiasis (HAT)","NO","NO","NO","YES","YES","NO","NO","NO","NO",2]
[{"$nulls":3},"Target Product Profile: Schistosomiasis Surveillance Diagnostic","YES","YES","NO","NO","NO","NO","NO","NO","NO",2]
[{"$nulls":3},"Target Product Profile: Schistosomiasis Surveillance Diagnostic Lateral Flow Test CAA antigen","YES","YES","NO","NO","NO","NO","NO","NO","NO",2]
[{"$nulls":3},"Target Product Profile: Trachoma Surveillance Diagnostic-Post-Elimination Surveillance Antibody Lateral Flow Test","YES","YES","NO","NO","NO","NO","NO","NO","NO",2]
[{"$nulls":3},"Target Product Profile: Screening test for human African trypanosomiasis (HAT)","NO","NO","NO","YES","YES","NO","NO","NO","NO",2]
[{"$nulls":3},"Target Product Profile: Trachoma surveillance diagnostic-antigen lateral flow test","YES","YES","NO","NO","NO","NO","NO","NO","NO",2]
[{"$nulls":3},"Target Product Profile: Schistosomiasis Surveillance Diagnostic - schistosoma genus-specific antibody lateral flow test post-elimination surveillance","YES","YES","NO","NO","NO","NO","NO","NO","NO",2]
[{"$nulls":3},"A Multiplex Multi-Analyte Diagnostic Platform","YES","NO","NO","YES","NO","NO","NO","NO","NO",2]
[{"$nulls":3},"Target Product Profile for Zaire ebolavirus rapid,simple test to be used in the control of the Ebola outbreak in West Africa","NO","NO","NO","NO","NO","YES","NO","NO","NO",1]
[{"$nulls":3},"New diagnostic tools in schistosomiasis","NO","NO","NO","NO","NO","NO","NO","NO","YES",1]
[{"$nulls":3},"UNICEF Target Product Profile Rapid E.coli Detection (version 2.0)","NO","NO","NO","NO","NO","NO","NO","NO","NO",0]
[{"$nulls":3},"UNICEF Target Product Profile Rapid E.coli Detection (version 1.4)","NO","NO","NO","NO","NO","NO","NO","NO","NO",0]
[{"$nulls":3},"Specifications for a rapid diagnostic test for meningitis African meningitis belt","NO","NO","NO","NO","NO","NO","NO","NO","NO",0]
[{"$nulls":3},"Target Product Profile (TPP) - Point-of-Care HIV Viral Load Test","NO","NO","NO","NO","NO","NO","NO","NO","NO",0]
[{"$nulls":3},"Target Product Profile (TPP)- Point of care CD4 test","NO","NO","NO","NO","NO","NO","NO","NO","NO",0]
[{"$nulls":3},"Target Product Profile: Point of care EID test","NO","NO","NO","NO","NO","NO","NO","NO","NO",0]
[{"$nulls":3},"Target Product Profile (TPP): Combined HIV/Syphilis Test","NO","NO","NO","NO","NO","NO","NO","NO","NO",0]

{"sheet":"Draft TPP ","index":8,"n_rows":45,"n_cols":7,"rows_kept":45}
["Author(s)","Article title","Checked?","Who writes the first draft?","How large is the consensus-building group? ","Does the consensus-building group usually include the authors surveyed/involved in drafting? ","Information on drafting phase?"]
["Chua, A. P., I.: Nuebling, C. M.: Wood, D.: Moussy, F.","Update on Zika Diagnostic Tests and WHO's Related Activities","Yes","It seems the authors drafted and collected inputs from different stakeholder groups","N.A. ","it does not specify. However, several consultations meetings were held by key stakeholders as opposed to a public consultation. So we can assume that the second group is bigger than the second, but it is not possible to know if it does contain stakeholders included/surveyed at the drafting phase","Yes/no"]
["Denkinger, C. M. D., D.: Schito, M.: Wells, W.: Cobelens, F.: Pai, M.: Zignol, M.: Cirillo, D. M.: Alland, D.: Casenghi, M.: Gallarda, J.: Boehme, C. C.: Perkins, M. D","Target Product Profile of a Molecular Drug-Susceptibility Test for Use in Microscopy Centers","Yes","Inputs were collected/gathered from all authors","Greater than 50 individuals","It does not specificy clearly. We might expect that more stakeholders have been surveyed in relation to the one consulted during the drafting phase but I am not 100% sure about this. It mentions a larger audience, so it might be the case","Yes"]
["Denkinger, C. M. K., Sandra V.: Cirillo, Daniela Maria: Casenghi, Martina: Shinnick, Thomas: Weyer, Karin: Gilpin, Chris: Boehme, Catharina C.: Schito, Marco: Kimerling, Michael: Pai, Madhuka","Defining the needs for next generation assays for tuberculosis","Yes","TPPs with highest priority were developed by MCGill University and FIND (First 2 authors are from these 2 institutions)","The shortened versions of the TPPs were presented to a large stakeholder audience-it does not specify","It does not specify clearly. It is reasonable to assume that the group is larger ","Yes"]
["DIAMETER Project, PATH","Point-of-Care Malaria Infection Detection Test For rapid detection of low-density, subclinical malaria infections","Yes","/","/","/","No"]
["Ding, X. C. A., Maria Paz: Baird, J. Kevin: Cheng, Qin: Cunningham, Jane: Dhorda, Mehul: Drakeley, Chris: Felger, Ingrid: Gamboa, Dionicia: Harbers, Matthias: Herrera, Socrates: Lucchi, Naomi: Mayor, Alfredo: Mueller, Ivo: Sattabongkot, Jetsumon: Ratsimbason, Arsène: Richards, Jack: Tanner, Marcel: González, Iveth J.","Defining the next generation of Plasmodium vivax diagnostic tests for control and elimination: Target product profiles","Yes","I am assuming the authors, but this is not clear","/","/","Yes/no"]
["Dittrich, S. T., B. T.: Moussy, F.: Chua, A.: Zorzet, A.: Tangden, T.: Dolinger, D. L.: Page, A. L.: Crump, J. A.: Valerie, D.: Bassat, Q.: Lubell, Y.: Heinrich, N.: Newton, P. N.: Rodwell, T.: Gonzalez, I. J.","Target Product Profile for a Diagnostic Assay to Differentiate between Bacterial and Non-Bacterial Infections to Guide Antimicrobials Use in Resource-Limited Settings: An Expert Consensus","Yes","Working group composed by 14-15 members which were identified based on their proven expertise in the field","13 participants ","It seems to me that working group participants convened to a meeting to gather consensus around TPP, not a new set of participants/stakeholder involved for this phase","Yes"]
["WHO","High-priority target product profile for hepatitis C diagnosis in decentralized settings: Report of a consensus meeting. ","Yes","Document was prepared by authors ( from FIND and Forum for Collaborative HIV Research)","First TPP: 36; Second TPP: 26 ","/","Yes/no"]
["Gal, M. F., N. A.: Hood, K.: Villacian, J.: Goossens, H.: Watkins, A.: Butler, C. C.","Matching diagnostics development to clinical need: Target product profile development for a point of care test for community-acquired lower respiratory tract infection","Yes","Document drafted by RAPID-IDD working group","/","/","Yes/no"]
["Lim, M. D. B., S. J.: Belizario, V. Y., Jr.: Gay-Andrieu, F.: Gilleard, J.: Levecke, B.: Lieshout, L. van: Medley, G. F.: Mekonnen, Z.: Mirams, G.: Njenga, S. M.: Odiere, M. R.: Rudge, J. W.: Stuyver, L.: Vercruysse, J.: Vlaminck, J.: Walson, J. L. ","Diagnostic tools for soil-transmitted helminths control and elimination programs: a pathway for diagnostic product development","yes","Authors + inputs from meetings with stakeholders","/","/","Yes/no"]
["Nsanzabana, C. A., Frederic: Beck, Hans-Peter: Ding, Xavier C.: Kamau, Edwin: Krishna, Sanjeev: Legrand, Eric: Lucchi, Naomi: Miotto, Olivo: Nag, Sidsel: Noedl, Harald: Roper, Cally: Rosenthal, Philip J.: Schallig, Henk D. F. H.: Taylor, Steve M.: Volkman, Sarah K.: Gonzalez, Iveth J.","Molecular assays for antimalarial drug resistance surveillance: A target product profile","Yes","It is not specified, I am assuming is the authors","18 (including 4 observers)","it seems that the majority of the authors took part in the consensus-building meeting","Yes/no"]
["Porras, A. I. Y., Z. E.: Altcheh, J.: Britto, C.: Chaves, G. C.: Flevaud, L.: Martins, O. A.: Ribeiro, I.: Schijman, A. G.: Shikanai-Yasuda, M. A.: Sosa-Estani, S.: Stobbaerts, E.: Zicker, F.","Target Product Profile (TPP) for Chagas Disease Point-of-Care Diagnosis and Assessment of Response to Treatmen","Yes","It is a consensus-based TPP: so the experts who convened to the meeting","/","/","No"]
["Reipold, E. I. E., Philippa: Trianni, Alessandra: Panneer, Nivedha: Krakower, Douglas: Ongarello, Stefano: Roberts, Teri: Miller, Veronica: Denkinger, Claudia","Optimising diagnosis of viraemic hepatitis C infection: the development of a target product profile","Yes","Original draft was developed by FIND, Forum for Collaborative HIV Research, WHO' Global Hepatitis Programme","First TPP: 36, second TPP: 26; attended consensus-meeting: 35",null,"Yes"]
["Solomon, A. W. E., D.: Bailey, R. L.: Blake, I. M.: Brooker, S.: Chen, J. X.: Chen, J. H.: Churcher, T. S.: Drakeley, C. J.: Edwards, T.: Fenwick, A.: French, M.: Gabrielli, A. F.: Grassly, N. C.: Harding-Esch, E. M.: Holland, M. J.: Koukounari, A.: Lammie, P. J.: Leslie, J.: Mabey, D. C.: Rhajaoui, M.: Secor, W. E.: Stothard, J. R.: Wei, H.: Willingham, A. L.: Zhou, X. N.: Peeling, R. W.","A diagnostics platform for the integrated mapping, monitoring, and surveillance of neglected tropical diseases: Rationale and target product profiles","Yes","Participants to consensus-building meeting, I am assuming supported by the authors","/","/","Yes/no"]
["Toskin, I. M., M.: Peeling, R. W.: Blondeel, K.: Cordero, J.: Kiarie, J.","Advancing prevention of sexually transmitted infections through point-of-care testing: target product profiles and landscape analysis","Yes","International Expert Group (IEG): which comprises 32 internationally recognised experts","It does not specify. I am assuming is the same as the IEG","I guess given what is written","Yes"]
["Donadeu, M. F., A. S.: Olliaro, P. L.: Abela-Ridder, B","Target product profiles for the diagnosis of Taenia solium taeniasis, neurocysticercosis and porcine cysticercosis","Yes","I am assuming the authors, but this is not clear","100 respondents","It seems so, but not clear","Yes/no"]
["FIND","Target Product Profile for Tests for Recent HIV Infection","Yes","Document was drafted by 3 authors (FIND) + working group (13 ppl)",37,"Some authors + some components of the working group took part of the consensus meeting. Additionally, some stakeholders which were interviewed at scoping phase took part as well ","Yes"]
["FIND","Target Product Profile: Rapid test for diagnosis of malaria and screening for hyman African trypanosomiasis (HAT)","Yes","It is not specified. No information on the drafting phase (also in terms of input sources)",5,"It is not possible to know given the poor information on the drafting phase. However, we can expect that these individuals are different from those involved in the drafting phase","No"]
["PATH","Target Product Profile: HIV Self-Test Version 4.1: A White Paper on the Evaluation of Current HIV Rapid Tests and Development of Core Specifications for Next-Generation HIV Tests","Yes","working group from PATH (n=5)","/","/","Yes"]
["PATH","Diagnostics for neglected tropical diseases: Defining the best tools through target product profiles","Yes","Working group from PATH (n=8)","/","/","Yes/no"]
["PATH","Target Product Profile: Schistosomiasis Surveillance Diagnostic","Yes","/","/","/","No"]
["UNICEF","UNICEF Target Product Profile Rapid E.coli Detection (version 2.0)","Yes","/","/","/","No"]
["UNICEF","UNICEF Target Product Profile Rapid E.coli Detection (1.4)","Yes","/","/","/","No"]
["WHO","High-priority target product profile for new tubercolosis diagnostics: report of a consensus meeting","yES","The TPP was prepared by Denkinger (find), Kik (McGill University, Casenghi (Medecines Sans Frontieres) ","39 participants ","It seems that authors took part in those meetings","Yes"]
["WHO","Development of a Target Product Profile (TPP) and framework for evaluation for a test predicting progression from tubercolosis infection to active disease","Yes","The document was prepared by Alberto Matteelli, Sandra Kik, Schumacher (FIND), Varga (FIND) + inputs from technical expert consultation group ","Approx 44","No, only 1 author/TEG","Yes"]
["WHO","Specifications for a rapid diagnostic test for meningitis African meningitis belt/ Target product profile for the development of a new generation of rapid test for the diagnosis of bacterial meningitis","Yes","/","/","/","No"]
["WHO","Target Product Profile for Zaire ebolavirus rapid,simple test to be used in the control of the Ebola outbreak in West Africa","Yes","it mentions contributions of different stakeholders/organisations","/","/","No"]
["WHO","Report of WHO-FIND meeting on diagnostics for Buruli ulcer","Yes","I am assuming authors plus inputs from stakeholders","Participants are 12","/","Yes/no"]
["WHO","Taenia solium taeniasis/cysticercosis diagnostic tools. Report of a stakeholder meeting","Yes","It seems that the TPP is the result of stakeholder meetintg","/","/","Yes/No"]
["Utzinger, J. B., S. L.: van Lieshout, L.: van Dam, G. J.: Knopp, S","New diagnostic tools in schistosomiasis","Yes","I am assuming the authors","/","/","No"]
["UNICEF","Zika Virus Diagnostics: Target Product Profiles & Supply Update","Yes","I am assuming the authors with inputs from key stakeholders. Not clear","/","/","Yes/no"]
["UNICEF","Pneumonia Acute Respiratory Infection Diagnostic Aid-Target Product Profile Introduction","Yes","It mentions interviews with experts, and an expert committee review. Not clear. Aciknowledged contribution for developing this TPP from WHO, Save the Children, Malaria Consortium. Bill and Melinda Gates Foundation PATH, industry and academia","/","/","Yes"]
["Pal S, Jasper L.E., Lawrence K.L, Walter M","Assessing the Dengue Diagnosis Capability Gap in the Military Health System","Yes","/",33,"/"]
["PATH","Target Product Profile: Schistosomiasis Surveillance Diagnostic Lateral Flow Test CAA antigen","Yes","/","/","/","No"]
["PATH","Target Product Profile: Trachoma Surveillance Diagnostic-Post-Elimination Surveillance Antibody Lateral Flow Test","Yes","/","/","/","/"]
["International Diagnostics Centre (IDC)","Target Product Profile (TPP) - Point-of-Care HIV Viral Load Test","Yes","/","/","/","No"]
["International Diagnostics Centre (IDC)","Target Product Profile (TPP)- Point of care CD4 test","Yes","/","/","/","No"]
["International Diagnostics Centre (IDC)","Target Product Profile (TPP): Point of care EID test","Yes","/","/","/","No"]
["Internationa Diagnostics Centre (IDC)","Target Product Profile (TPP): Combined HIV/Syphilis Test","Yes","/","/","/","No"]
["Ebels, K. B. C., C.: Crudder, C. H.: McGray, S.: Magnuson, K.: Tietje, K.: Labarre, P","Incorporating user needs into product development for improved infection detection for malaria elimination programs","Yes","I am assuming the authors, but this is not clear","/","/","Yes/no"]
["FIND","Target Product Profile: Screening test for human African trypanosomiasis (HAT)","Yes","/",7,"/","No"]
["PATH","Target Product Profile: Trachoma surveillance diagnostic-antigen lateral flow test","Yes","/","/","/","No"]
["Peck, R. B. W., J. D.: Boettcher, M. G.: Downing","Defining product requirements for field deployable yellow fever tests","Yes","I am assuming the authors ","/","/","Yes"]
["PATH","Target Product Profile: Schistosomiasis Surveillance Diagnostic - schistosoma genus-specific antibody lateral flow test post-elimination surveillance","Yes","/","/","/","No"]
["WHO, FIND, Medecins sans Frontiers","A Multiplex Multi-Analyte Diagnostic Platform","Yes","I am assuming the authors with inputs from survey respondents","/","/","No"]

{"sheet":"Additional data part 1","index":9,"n_rows":49,"n_cols":11,"rows_kept":49,"merged":[[0,1,0,8],[0,9,0,10]]}
[null,"Price estimates",{"$nulls":7},"Diagnostic accuracy estimates"]
["Study title","Were price estimates included?","Input source - price estimate","Was the input source for price estimate reported?","Literature","Decision model","Study","Expert consensus","Report","Definition of clinical sen spec","Reference standard mentioned"]
["Molecular assays for antimalarial drug resistance surveillance: A target product profile","Yes","Test evaluation study (literature)","Yes","x",{"$nulls":4},"Greater than 95%","YES"]
["High-priority target product profile for new tubercolosis diagnostics: report of a consensus meeting","Yes","1) published results from a survey of experts being asked to provide a cost value for one smear in their country (n=22) 2) Decision-analytic model 3) published WHO policies 4)ongoing cost and affordability study was presented at the meeting (unpublished data)","Yes","x","x","x",null,null,"Greater than 80","YES"]
["Target Product Profile for a Diagnostic Assay to Differentiate between Bacterial and Non-Bacterial Infections to Guide Antimicrobials Use in Resource-Limited Settings: An Expert Consensus","Yes","Expert consensus","Yes",{"$nulls":3},"x",null,"Greater than 95%","No - lack of reference standard?"]
["High-priority target product profile for hepatitis C diagnosis in decentralized settings: Report of a consensus meeting. ","Yes","NA","No",{"$nulls":5},"Greater than 99%","Yes "]
["Diagnostic tools for soil-transmitted helminths control and elimination programs: a pathway for diagnostic product development","No","NA","No",{"$nulls":5},{"v":0.95,"d":"95%"},"Yes"]
["Target Product Profile of a Molecular Drug-Susceptibility Test for Use in Microscopy Centers",{"$nulls":8},"Greater than 95/99%","Yes"]
["Optimising diagnosis of viraemic hepatitis C infection: the development of a target product profile","Yes","NA","No",{"$nulls":5},"Greater than 99%","Yes"]
["Advancing prevention of sexually transmitted infections through point-of-care testing: target product profiles and landscape analysis","Yes","Expert consensus","Yes",{"$nulls":3},"x",null,"Greater than 90%,99%","Yes"]
["Target Product Profile for Tests for Recent HIV Infection","Yes","NA","No",{"$nulls":5},"NA","NA"]
["Development of a Target Product Profile (TPP) and framework for evaluation for a test predicting progression from tubercolosis infection to active disease","Yes","Expert consensus","Yes ",{"$nulls":3},"x",null,"Greater than 90%","NA"]
["Taenia solium taeniasis/cysticercosis diagnostic tools. Report of a stakeholder meeting","Yes","NA","No",{"$nulls":5},{"v":0.99,"d":"99%"},"NA"]
["Defining product requirements for field deployable yellow fever tests","No","NA","No",{"$nulls":5},"Greater than 95,99%","NA"]
["Defining the needs for next generation assays for tuberculosis","Yes","NA","No",{"$nulls":5},"Greater than 95,99%","Yes"]
["Defining the next generation of Plasmodium vivax diagnostic tests for control and elimination: Target product profiles","Yes","Randomised cost-effectiveness trial (Batwala)//literature research agenda for malaria eradication","Yes","x",null,"x",null,null,"Greater than 99%","Yes"]
["Matching diagnostics development to clinical need: Target product profile development for a point of care test for community-acquired lower respiratory tract infection","Yes","NA","No",{"$nulls":5},{"v":1,"d":"100%"},"NA"]
["Diagnostics for neglected tropical diseases: Defining the best tools through target product profiles",{"$nulls":8},"No optimal sen spec being reported","NA"]
["Report of WHO-FIND meeting on diagnostics for Buruli ulcer",{"$nulls":8},"Not explict - just said equal to polymerase chain reaction","NA"]
["Assessing the Dengue Diagnosis Capability Gap in the Military Health System",{"$nulls":8},"Not explictily quantify - high sen high spec","NA"]
["Target Product Profile (TPP) for Chagas Disease Point-of-Care Diagnosis and Assessment of Response to Treatmen",{"$nulls":8},"100% specificity","Yes"]
["Target product profiles for the diagnosis of Taenia solium taeniasis, neurocysticercosis and porcine cysticercosis","Yes","Expert opinion","Yes, in the main text - based on the feedback provided",{"$nulls":3},"x",null,"Greater than 99%","Yes"]
["Target Product Profile: HIV Self-Test Version 4.1: A White Paper on the Evaluation of Current HIV Rapid Tests and Development of Core Specifications for Next-Generation HIV Tests","Yes","Literature findings, PATH studies on end-users' willigness-to-pay, expert opinion","Yes","x",null,"x","x",null,"Greater than 99%","Yes"]
["Zika Virus Diagnostics: Target Product Profiles & Supply Update",{"$nulls":8},"Greater than 98%","No validated reference method to determine the clinical diagnostic sensitivity"]
["Pneumonia Acute Respiratory Infection Diagnostic Aid-Target Product Profile Introduction","No","NA","No",{"$nulls":5},{"$f":"J18","v":"No optimal sen spec being reported"},{"$f":"K18","v":"NA"}]
["Incorporating user needs into product development for improved infection detection for malaria elimination programs",{"$nulls":8},"Not explictly quantified - false positive methods comparable to existing methods","NA"]
["Update on Zika Diagnostic Tests and WHO's Related Activities",{"$nulls":8},"Greater than 98%",{"$f":"K24","v":"No validated reference method to determine the clinical diagnostic sensitivity"}]
["Point-of-Care Malaria Infection Detection Test For rapid detection of low-density, subclinical malaria infections","Yes","NA","No",{"$nulls":5},{"v":0.98,"d":"98%"},"Yes"]
["A diagnostics platform for the integrated mapping, monitoring, and surveillance of neglected tropical diseases: Rationale and target product profiles",{"$nulls":8},{"v":0.995,"d":"99.50%"},"Yes"]
["Target Product Profile: Rapid test for diagnosis of malaria and screening for hyman African trypanosomiasis (HAT)","Yes","NA","No",{"$nulls":5},{"v":0.8,"d":"80%"},"Yes"]
["Target Product Profile: Schistosomiasis Surveillance Diagnostic","Yes","Literature findings (Assefa) - cost analysis study in Kenya","Yes",null,null,"x",null,null,"Optimal greater than 95% sen, spec 99%","Yes"]
["Target Product Profile: Schistosomiasis Surveillance Diagnostic Lateral Flow Test CAA antigen","Yes","Literature findings (Assefa) - cost analysis study in Kenya","Yes",null,null,"x",null,null,"Optimal greater than 95% sen, spec 99%","Yes"]
["Target Product Profile: Trachoma Surveillance Diagnostic-Post-Elimination Surveillance Antibody Lateral Flow Test","Yes","Report","Yes",{"$nulls":4},"x","Optimal greater than 95% sen, spec 99%","Yes"]
["Target Product Profile: Screening test for human African trypanosomiasis (HAT)","Yes","NA","No",{"$nulls":5},"100%,99%","No"]
["Target Product Profile: Trachoma surveillance diagnostic-antigen lateral flow test","Yes","Report","Yes",{"$nulls":4},"x","Optimal sensitivity 99%","Yes"]
["Target Product Profile: Schistosomiasis Surveillance Diagnostic - schistosoma genus-specific antibody lateral flow test post-elimination surveillance","Yes","Literature findings (Assefa) - cost analysis study in Kenya","Yes",null,null,"x",null,null,"Optimal sensitivity 99%","Yes"]
["A Multiplex Multi-Analyte Diagnostic Platform","Yes","NA","No",{"$nulls":5},"100% - sen spec minimal and optimal sorted by industry and non-industry representatives","No"]
["Target Product Profile for Zaire ebolavirus rapid,simple test to be used in the control of the Ebola outbreak in West Africa","No","NA","No",{"$nulls":5},"Greater than 95%","Yes"]
["New diagnostic tools in schistosomiasis",{"$nulls":8},{"v":0.99,"d":"99%"},"Yes"]
["UNICEF Target Product Profile Rapid E.coli Detection (version 2.0)","Yes","NA","No",{"$nulls":5},"Not explictly quantified, it only mentions false-positive rate","Vague - reference standards"]
["UNICEF Target Product Profile Rapid E.coli Detection (version 1.4)","Yes","NA","No",{"$nulls":5},"Not explictly quantified, it only mentions false-positive rate","Vague - reference standards"]
["Specifications for a rapid diagnostic test for meningitis African meningitis belt","Yes","NA","No",{"$nulls":5},"Greater than 90%","Yes"]
["Target Product Profile (TPP) - Point-of-Care HIV Viral Load Test","Yes","NA","No",{"$nulls":5},"No optimal sen spec being reported","NA"]
["Target Product Profile (TPP)- Point of care CD4 test","Yes","NA","No",{"$nulls":5},"Greater than 90%","No"]
["Target Product Profile: Point of care EID test","Yes","NA","No",{"$nulls":5},"Greater than 98%","No"]
["Target Product Profile (TPP): Combined HIV/Syphilis Test","Yes","NA","No",{"$nulls":5},"Greater than 99% and 95%","No"]
[]
[{"$nulls":4},{"$f":"COUNTIF(E3:E36,\"x\")","v":4},{"$f":"COUNTIF(F3:F36,\"x\")","v":1},6,5,2]
[{"$nulls":4},{"$f":"E48/(30-17)","v":{"v":0.3076923076923077,"d":"31%"}},{"$f":"F48/(30-17)","v":{"v":0.07692307692307693,"d":"8%"}},{"v":0.46153846153846156,"d":"46%"},{"v":0.38461538461538464,"d":"38%"},{"v":0.15384615384615385,"d":"15%"}]

{"sheet":"Additional data part 2","index":10,"n_rows":45,"n_cols":15,"rows_kept":45}
["Article title","Test(s) being assessed","Diagnostic test","Monitoring","Screening test","Predicting","Prognostic","Treatment monitoring test","Other","Specific definition of test technology","Generic technology","Notes","Results","n","%"]
["Update on Zika Diagnostic Tests and WHO's Related Activities","Diagnostic test for zika infection and blood bank testing ","x",{"$nulls":5},"x",null,"x",{"$f":"IF(J2=\"\",IF(K2=\"\",\"x\",\"\"),\"\")","v":""},"Diagnosis",{"$f":"COUNTIF(C2:C45,\"x\")","v":39},{"$f":"N2/44","v":{"v":0.8863636363636364,"d":"89%"}}]
["Target Product Profile of a Molecular Drug-Susceptibility Test for Use in Microscopy Centers","A molecular drug-susceptibility test","x",{"$nulls":7},"x",{"$f":"IF(J3=\"\",IF(K3=\"\",\"x\",\"\"),\"\")","v":""},"Screening",{"$f":"COUNTIF(E2:E45,\"x\")","v":6},{"$f":"N3/44","v":{"v":0.13636363636363635,"d":"14%"}}]
["Defining the needs for next generation assays for tuberculosis","1) A diagnostic test 2) A diagnostic biomarker test 3) A referall screening test","x",null,"x",{"$nulls":5},"x","Eg Rapid, sputum-based, cartridge-based, molecular test for microscopy centers (with the adoption of add-on DST cartridge)","Monitoring",{"$f":"COUNTIF(D2:D45,\"x\")","v":7},{"v":0.1590909090909091,"d":"16%"}]
["Point-of-Care Malaria Infection Detection Test For rapid detection of low-density, subclinical malaria infections","A POC infection detection test","x",{"$nulls":7},"x","","Prognosis",{"$f":"COUNTIF(G2:G45,\"x\")","v":0},{"$f":"N5/44","v":{"v":0,"d":"0%"}}]
["Defining the next generation of Plasmodium vivax diagnostic tests for control and elimination: Target product profiles","1) A diagnostic test 2) A POC diagnostic test 3) A screening test","x",null,"x",{"$nulls":5},"x","","Other",{"$f":"COUNTIF(I2:I45,\"x\")","v":4},{"$f":"N6/44","v":{"v":0.09090909090909091,"d":"9%"}}]
["Target Product Profile for a Diagnostic Assay to Differentiate between Bacterial and Non-Bacterial Infections to Guide Antimicrobials Use in Resource-Limited Settings: An Expert Consensus","A test to distinguish bacterial from non-bacterial infections","x",{"$nulls":7},"x","",{"$f":"J1","v":"Specific definition of test technology"},{"$f":"COUNTIF(J2:J45,\"x\")","v":8},{"$f":"N7/44","v":{"v":0.18181818181818182,"d":"18%"}}]
["High-priority target product profile for hepatitis C diagnosis in decentralized settings: Report of a consensus meeting. ","1) HCV nucleic acid amplification diagnostic test 2) HCV cAg diagnostictest","x",{"$nulls":6},"x",null,"",{"$f":"K1","v":"Generic technology"},{"$f":"COUNTIF(K2:K45,\"x\")","v":36},{"$f":"N8/44","v":{"v":0.8181818181818182,"d":"82%"}}]
["Matching diagnostics development to clinical need: Target product profile development for a point of care test for community-acquired lower respiratory tract infection","POC test","x",{"$nulls":7},"x",""]
["Diagnostic tools for soil-transmitted helminths control and elimination programs: a pathway for diagnostic product development","1) a diagnostic test for mapping-monitoring 2) diagnostic test to confirm decision to stop intervention","x","x",{"$nulls":6},"x","","it defines different uses cases (e.g. 1) determine STH transmission and identify type of MDA 2) assess progress against program goals 3) confirm a decision to stop intervention and transition to surveillance 4) verify sustained break in transmission)"]
["Molecular assays for antimalarial drug resistance surveillance: A target product profile","Antimalarial drug resistance molecular diagnostic test","x",{"$nulls":7},"x",""]
["Target Product Profile (TPP) for Chagas Disease Point-of-Care Diagnosis and Assessment of Response to Treatmen","1-2) a POC diagnostic test 3) a treatment-monitoring test","x","x",{"$nulls":3},"x",null,null,"x",""]
["Optimising diagnosis of viraemic hepatitis C infection: the development of a target product profile","A point-of-care/near patient diagnostic test","x",{"$nulls":7},"x",""]
["A diagnostics platform for the integrated mapping, monitoring, and surveillance of neglected tropical diseases: Rationale and target product profiles","1) A diagnostic tool with mapping and impact monitoring potential 2) A diagnostic tool","x","x",{"$nulls":6},"x",""]
["Advancing prevention of sexually transmitted infections through point-of-care testing: target product profiles and landscape analysis","A combined diagnostic POC 2) POC platforms 3) A combined diagnostic test","x",{"$nulls":7},"x",""]
["Target product profiles for the diagnosis of Taenia solium taeniasis, neurocysticercosis and porcine cysticercosis","1) A POC test that could be used for surveillance 2) A specific test 3)A POC test 4) A monitoring test",null,"x",{"$nulls":6},"x",""]
["Target Product Profile for Tests for Recent HIV Infection","A diagnostic test","x",{"$nulls":7},"x",""]
["Target Product Profile: Rapid test for diagnosis of malaria and screening for hyman African trypanosomiasis (HAT)","Rapid test for diagnosis and screening","x",null,"x",{"$nulls":5},"x",""]
["Target Product Profile: HIV Self-Test Version 4.1: A White Paper on the Evaluation of Current HIV Rapid Tests and Development of Core Specifications for Next-Generation HIV Tests","A rapid diagnostic self-test","x",{"$nulls":7},"x",""]
["Diagnostics for neglected tropical diseases: Defining the best tools through target product profiles","1) lateral flow tests for antigen biomarkers 2) nucleic acid amplification tests","x",{"$nulls":6},"x",null,""]
["Target Product Profile: Schistosomiasis Surveillance Diagnostic","A rapid diagnostic test","x",{"$nulls":7},"x",""]
["UNICEF Target Product Profile Rapid E.coli Detection (version 2.0)","Water quality testing product",{"$nulls":6},"x",null,"x",""]
["UNICEF Target Product Profile Rapid E.coli Detection (1.4)","Water quality testing product",{"$nulls":6},"x",null,"x",""]
["High-priority target product profile for new tubercolosis diagnostics: report of a consensus meeting","1) A diagnostic test 2) A diagnostic biomarker test 3) A referall screening test 4) A drug-susceptibility test","x",null,"x",{"$nulls":5},"x",""]
["Development of a Target Product Profile (TPP) and framework for evaluation for a test predicting progression from tubercolosis infection to active disease","A test for predicting disease progression",{"$nulls":3},"x",{"$nulls":4},"x",""]
["Specifications for a rapid diagnostic test for meningitis African meningitis belt/ Target product profile for the development of a new generation of rapid test for the diagnosis of bacterial meningitis","A rapid diagnostic test","x",{"$nulls":7},"x",""]
["Target Product Profile for Zaire ebolavirus rapid,simple test to be used in the control of the Ebola outbreak in West Africa","A rapid diagnostic test","x",{"$nulls":7},"x",""]
["Report of WHO-FIND meeting on diagnostics for Buruli ulcer","1) A rapid diagnostic test 2)A diagnostic test with treatment-monitoring potential","x","x",{"$nulls":6},"x",""]
["Taenia solium taeniasis/cysticercosis diagnostic tools. Report of a stakeholder meeting","screening, diagnostic, track and treat, food safety","x",null,"x",null,null,"x","x",null,"x",""]
["New diagnostic tools in schistosomiasis","1) A diagnostic test for mapping-monitoring 2) A diagnostic tool","x","x",{"$nulls":6},"x",""]
["Zika Virus Diagnostics: Target Product Profiles & Supply Update","A diagnostic test ","x",{"$nulls":7},"x",""]
["Pneumonia Acute Respiratory Infection Diagnostic Aid-Target Product Profile Introduction","A diagnostic aid","x",{"$nulls":7},"x",""]
["Assessing the Dengue Diagnosis Capability Gap in the Military Health System","A diagnostic test","x",{"$nulls":7},"x",""]
["Target Product Profile: Schistosomiasis Surveillance Diagnostic Lateral Flow Test CAA antigen","A lateral flow test for stopping decision for mass drug administration","x",{"$nulls":4},"x",null,"x",null,""]
["Target Product Profile: Trachoma Surveillance Diagnostic-Post-Elimination Surveillance Antibody Lateral Flow Test","A lateral flow rapid diagnostic test","x",{"$nulls":6},"x",null,""]
["Target Product Profile (TPP) - Point-of-Care HIV Viral Load Test","A POC test","x",{"$nulls":7},"x",""]
["Target Product Profile (TPP)- Point of care CD4 test","A POC test","x",{"$nulls":7},"x",""]
["Target Product Profile (TPP): Point of care EID test","A POC","x",{"$nulls":7},"x",""]
["Target Product Profile (TPP): Combined HIV/Syphilis Test","A combined test","x",{"$nulls":7},"x",""]
["Incorporating user needs into product development for improved infection detection for malaria elimination programs","A diagnostic test","x",{"$nulls":7},"x",""]
["Target Product Profile: Screening test for human African trypanosomiasis (HAT)","A screening test",null,null,"x",{"$nulls":5},"x",""]
["Target Product Profile: Trachoma surveillance diagnostic-antigen lateral flow test","A lateral flow test to inform stopping decision phase for mass drug administration","x",{"$nulls":4},"x",null,"x",null,""]
["Defining product requirements for field deployable yellow fever tests","A field-deployable test - individual application in clinical care, mapping endemic regions to inform vaccination priorities and monitoring outbreak response","x","x",{"$nulls":5},"x",null,""]
["Target Product Profile: Schistosomiasis Surveillance Diagnostic - schistosoma genus-specific antibody lateral flow test post-elimination surveillance","A lateral flow test","x",{"$nulls":6},"x",null,""]
["A Multiplex Multi-Analyte Diagnostic Platform","A multiplex multi-analyte platform","x",{"$nulls":6},"x",null,""]

{"sheet":"Percentages","index":11,"n_rows":11,"n_cols":11,"rows_kept":11,"merged":[[2,0,2,1],[2,4,2,5],[9,0,9,1]]}
[]
[]
["Type of publication",{"$nulls":3},"Source TPPs",{"$nulls":3},"Disease area TPP","n","%"]
[null,"n","%",null,null,"n","%",null,"Vector-borne infection/diseases",14,{"v":0.3181818181818182,"d":"32%"}]
["Journal article",{"$f":"COUNTIF('Data extraction-synthesis'!$E$2:$E$45,\"Journal article\")","v":16},{"$f":"B5/44","v":{"v":0.36363636363636365,"d":"36%"}},null,"Database search",{"$f":"COUNTIF('Data extraction-synthesis'!P2:P45,\"Database search\")","v":9},{"$f":"F5/44","v":{"v":0.20454545454545456,"d":"20%"}},null,"Neglected tropical diseases",14,{"v":0.3181818181818182,"d":"32%"}]
["Report",{"$f":"COUNTIF('Data extraction-synthesis'!$E$2:$E$45,\"Report\")","v":23},{"$f":"B6/44","v":{"v":0.5227272727272727,"d":"52%"}},null,"Website search ",{"$f":"COUNTIF('Data extraction-synthesis'!P2:P45,\"Website search \")","v":28},{"$f":"F6/44","v":{"v":0.6363636363636364,"d":"64%"}},null,"Sexually transmitted infections/diseases",7,{"v":0.1590909090909091,"d":"16%"}]
["Published TPP",{"$f":"COUNTIF('Data extraction-synthesis'!$E$2:$E$45,\"Published TPP\")","v":4},{"$f":"B7/44","v":{"v":0.09090909090909091,"d":"9%"}},null,"Both",{"$f":"COUNTIF('Data extraction-synthesis'!P2:P45,\"Both\")","v":7},{"$f":"F7/44","v":{"v":0.1590909090909091,"d":"16%"}},null,"Respiratory infections",6,{"v":0.13636363636363635,"d":"14%"}]
["Poster",{"$f":"COUNTIF('Data extraction-synthesis'!$E$2:$E$45,\"Poster\")","v":1},{"$f":"B8/44","v":{"v":0.022727272727272728,"d":"2%"}},{"$nulls":5},"E coli",0,{"v":0,"d":"0%"}]
[null,{"$f":"SUM(B5:B8)","v":44},{"$f":"SUM(C5:C8)","v":{"v":1,"d":"100%"}},{"$nulls":5},"Ebola virus",1,{"v":0.022727272727272728,"d":"2%"}]
[{"$nulls":8},"Meningits",1,{"v":0.022727272727272728,"d":"2%"}]
[{"$nulls":8},"Fever",1,{"v":0.022727272727272728,"d":"2%"}]

{"sheet":"Settings","index":12,"n_rows":27,"n_cols":12,"rows_kept":27}
["Type of publication","Number of test being assessed","Objective TPP","Type of TPP","Type of input sources selected to populate the TPP(s) of interest","How the quantitative TPP test characteristic (especially sensitivity and specificity) are reported","Type of input sources considered during scoping phase","Decision-making steps underlying the development of TPP(s) of interest","Type of stakeholders involved","Definition of minimal test characteristics","Definition of optimal test characteristics"]
["Journal article",1,"To outline the desirable product characteristics","Consensus-based","Literature","Range","Literature ","Consensus/public meeting","Industry (unspecific)","(Lowest) acceptable specification"," Ideal value for that characteristic","YES"]
["Report",2,"To guide manufacturers to design a test that meets certain needs ","Draft document","Industry standard","Absolute value","Mathematical models","Meeting with experts/stakeholders ","Test developers","Set to provide a distinguishing advantage over existing solution","Value that provides optimal diagnostic effectiveness ","NO"]
["Published TPP",3,"To identify needs for new products","Based on an existing one","Guidelines","Absolute value and range","Interviews/ Questionnaire with experts","Feedback from the consultation (e.g. survey, meeting, expert opinion) is incorporated into the final TPPs","Academia/researchers","Must-have characteristics","Nice-to-have characteristics","Input source not reported"]
["Poster",4,"Other ","Interview-based","Interviews with experts","No quantities reported","Ethnographic interviews","Mapping  ","Clinicians","Other","Ideal values that would make a tool more attractive/valuable "]
[null,null,"N/A ","N/A","Surveys with experts/expert opinion",null,"Field research","Market analyses ","Representatives of countries and national disease programs","No minimal test characteristic reported","No minimal test characteristic reported"]
[{"$nulls":4},"Consensus meeting inputs",null,"Reports","Literature search ","International/public health institution ","N/A","N/A"]
[{"$nulls":4},"Available data",null,"Policies","Survey to retrieve input relevant for TPP ","Experts (unspecific)"]
[{"$nulls":4},"Field observations",null,"Websites of developers","Landscaping exercise ","Laboratory experts"]
[{"$nulls":4},"Laboratory evaluations",null,"Market analyses","Draft TPP","Non-profit sector"]
[{"$nulls":4},"Models ",null,"Survey with experts/Expert opinion","Round of revisions of TPP","Technical/funding agencies "]
[{"$nulls":4},"Meeting input",null,"Questionnaire provided to expert","Draft shortened TPP","Policy makers"]
[{"$nulls":4},"Early usability studies ",null,"Meeting inputs","Presentation of shortened TPP to large stakeholder audience","Implementers"]
[{"$nulls":4},"No input sources reported",null,"Data available","Identification of most important needs","Patient/community advocates"]
[{"$nulls":4},"N/A",null,"Other","Prioritization exercise ","Microbiologists"]
[{"$nulls":6},"N/A","Delphi-like approach to gauge stakeholders’ agreement with the TPP","Modelers"]
[{"$nulls":6},"No scoping phase reported","Data analysis","Health economists"]
[{"$nulls":7},"Definition problem statement/use case  ","Market experts"]
[{"$nulls":7},"Identification of stakeholders to involve in draft TPP "," Program manager"]
[{"$nulls":7},"Definition TPP domains ","Scientific associations"]
[{"$nulls":7},"Survey to measure stakeholder’s preferences and agreement ","Strategists"]
[{"$nulls":7},"Reviewing available literature and data","Other"]
[{"$nulls":7},"Defining scope TPP ","N/A"]
[{"$nulls":7},"Interview with stakeholders","Donors"]
[{"$nulls":7},"Field research "]
[{"$nulls":7},"Consolidation of findings"]
[{"$nulls":7},"N/A "]